Weapon
has frame relation: Bearing arms
inherits from: Artifact
has frame relation: Artifact
narrower match: synset-biological-adjective-2
has lex unit: crossbow.n
has lex unit: Scud-C missile.n
type: Frame
has lex unit: forty-four.n
has lex unit: BW.n
has lex unit: firearm.n
subclass of: Artifact
has lex unit: shotgun.n
has lex unit: nuclear.adj
has lex unit: biological weapon.n
has lex unit: atomic bomb.n
narrower match: synset-nuclear-adjective-1
has lex unit: chemical.adj
has lex unit: gun.n
has lex unit: nerve gas.n
is used by: Ammunition
has lex unit: revolver.n
has frame element: Type.weapon
has lex unit: atomic weapon.n
has lex unit: rifle.n
narrower match: synset-explosive-adjective-1
has frame element: Wielder.weapon
has frame element: Creator.weapon
has lex unit: nuclear.a
has lex unit: Scud-B missile.n
type: Class
has lex unit: small arms.n
has lex unit: automatic weapon.n
narrower match: synset-chemical-adjective-1
has lex unit: WMD.n
has lex unit: chemical weapon.n
has lex unit: EFP.n
has lex unit: six-shooter.n
has lex unit: spear.n
has lex unit: CW.n
has frame element: Time of creation.weapon
inherits from: Entity
frame c date: 2002-11-25T15:31:15+01:00
has lex unit: arsenal.n
has frame element: Weapon.weapon
has frame element: Descriptor.weapon
narrower match: synset-strategic-adjective-1
has lex unit: biological.adj
is used by: Bearing arms
has lex unit: warhead.n
has frame element: Part.weapon
has frame relation: Improvised explosive device
has lex unit: rocket.n
has lex unit: explosive.adj
has lex unit: handgun.n
has lex unit: mortar.n
has lex unit: assault rifle.n
has lex unit: club.n
has lex unit: ordnance.n
has lex unit: shooter.n
comment: A Weapon is an artifact created specifically to cause harm or damage. In some cases, a Use, Material of construction, Part or Type may be more narrowly specified. Did you, or did you not, fire this gun with intent to harm my client? Cyra tried to swing her sword to parry, but it was to heavy. I investigated a specialist precious metal firearms manufacturer. My neighbor, a member of the NRA since birth, has got an AK-47 fully automatic assault rifle. Let 's just say that he 's the kind of guy who likes guns with hair triggers.
has lex unit: artillery.n
has lex unit: plastic explosive.n
has lex unit: grenade.n
has lex unit: dynamite.n
has lex unit: weaponry.n
has lex unit: strategic nuclear weapon.n
frame ID: 426
has lex unit: phosgene.n
has lex unit: bomb.n
has lex unit: arms.n
has lex unit: sword.n
has lex unit: weapon.n
has lex unit: explosive.n
has lex unit: bow.n
has lex unit: shell.n
frame name: Weapon
has lex unit: icbm.n
has lex unit: explosive.a
has lex unit: pistol.n
has lex unit: RPG.n