Vehicle
type: Frame
type: Class
comment: The frame concerns the vehicles that human beings use for the purpose of transportation. I drove a limo to the school dance.
subclass of: Artifact
inherits from: Entity
inherits from: Artifact
definition: The frame concerns the vehicles that human beings use for the purpose of transportation.
definition: <def-root>The frame concerns the vehicles that human beings use for the purpose of transportation.</def-root>
definition: The frame concerns the vehicles that human beings use for the purpose of transportation. I drove a limo to the school dance.
frame ID: 429
frame c by: GlY
frame c date: 2002-12-05T12:14:28+01:00
frame name: Vehicle
has frame element: Possessor.vehicle
has frame element: Descriptor.vehicle
has frame element: Itinerary.vehicle
has frame element: Vehicle.vehicle
has frame element: Means of propulsion.vehicle
has frame element: Use.vehicle
has frame relation: Convoy
has frame relation: Artifact
has frame relation: Vehicle subpart
has lex unit: train.n
has lex unit: boat.n
has lex unit: helo.n
has lex unit: vehicle.n
has lex unit: van.n
has lex unit: lorry.n
has lex unit: buggy.n
has lex unit: coach.n
has lex unit: tricycle.n
has lex unit: submarine.n
has lex unit: vessel.n
has lex unit: ferry.n
has lex unit: kayak.n
has lex unit: minivan.n
has lex unit: tank car.n
has lex unit: canoe.n
has lex unit: pick-up.n
has lex unit: truck.n
has lex unit: toboggan.n
has lex unit: schooner.n
has lex unit: warplane.n
has lex unit: helicopter.n
has lex unit: yacht.n
has lex unit: airplane.n
has lex unit: liner.n
has lex unit: carriage.n
has lex unit: bike.n
has lex unit: bicycle.n
has lex unit: aeroplane.n
has lex unit: plane.n
has lex unit: cab.n
has lex unit: chopper.n
has lex unit: bird.n
has lex unit: cart.n
has lex unit: ambulance.n
has lex unit: automobile.n
has lex unit: ship.n
has lex unit: aircraft.n
has lex unit: car.n
has lex unit: taxi.n
has lex unit: tank.n
has lex unit: scooter.n
has lex unit: tram.n
has lex unit: convertible.n
has lex unit: sedan.n
has lex unit: bus.n
has lex unit: limousine.n
is used by: Convoy
is used by: Vehicle subpart