Travel
has frame relation: Setting out
has lex unit: excursion.n
has frame element: Purpose.travel
has frame element: Source.travel
frame name: Travel
has frame relation: Self motion
has frame element: Distance.travel
has frame element: Traveler.travel
inherits from: Intentionally act
has frame element: Explanation.travel
has lex unit: junket.n
has lex unit: journey.v
has f ecore set: travel coreSet2
comment: In this frame a Traveler goes on a journey, an activity, generally planned in advance, in which the Traveler moves from a Source location to a Goal along a Path or within an Area. The journey can be accompanied by Co-participants and Baggage. The Duration or Distance of the journey, both generally long, may also be described as may be the Mode_of_transportation. Words in this frame emphasize the whole process of getting from one place to another, rather than profiling merely the beginning or the end of the journey. Ellen journeyed to Europe with five suitcases. Samantha journeyed 2500 miles with her family by sea to China.The Osbournes took a trip from Beverly Hills to London on the Concorde.
has frame element: Reason.travel
subclass of: Self motion
has frame element: Co-participant.travel
frame ID: 343
has lex unit: expedition.n
has frame element: Frequency.travel
frame c date: 2002-06-04T18:58:25+02:00
frame c by: ACW
has subframe: Setting out
has lex unit: voyage.n
has frame element: Area.travel
has frame element: Place.travel
definition: In this frame a Traveler goes on a journey, an activity, generally planned in advance, in which the Traveler moves from a Source location to a Goal along a Path or within an Area. The journey can be accompanied by Co-participants and Baggage. The Duration or Distance of the journey, both generally long, may also be described as may be the Mode_of_transportation. Words in this frame emphasize the whole process of getting from one place to another, rather than profiling merely the beginning or the end of the journey. Ellen journeyed to Europe with five suitcases. Samantha journeyed 2500 miles with her family by sea to China.The Osbournes took a trip from Beverly Hills to London on the Concorde.
has frame element: Duration.travel
has frame element: Depictive.travel
has lex unit: traveler.n
has frame element: Travel means.travel
definition: <def-root>In this frame a <fen>Traveler</fen> goes on a journey, an activity, generally planned in advance, in which the <fen>Traveler</fen> moves from a <fen>Source</fen> location to a <fen>Goal</fen> along a <fen>Path</fen> or within an <fen>Area</fen>. The journey can be accompanied by <fen>Co_participant</fen>s and <fen>Baggage</fen>. The <fen>Duration</fen> or <fen>Distance</fen> of the journey, both generally long, may also be described as may be the <fen>Mode_of_transportation</fen>. Words in this frame emphasize the whole process of getting from one place to another, rather than profiling merely the beginning or the end of the journey. <ex><fex name="Traveler">Ellen</fex> <t>journeyed</t> <fex name="Goal">to Europe</fex> <fex name="Baggage">with five suitcases</fex>.</ex> <ex><fex name="Traveler">Samantha</fex> <t>journeyed</t> <fex name="Distance">2500 miles</fex> <fex name="Co_participant">with her family</fex> <fex name="Path">by sea</fex> <fex name="Goal">to China</fex>.</ex><ex><fex name="Traveler">The Osbournes</fex> <m>took</m> a <t>trip</t> <fex name="Source">from Beverly Hills</fex> <fex name="Goal">to London</fex> <fex name="Mode_of_transportation">on the Concorde</fex>.</ex></def-root>
has lex unit: safari.n
has lex unit: commute.v
has frame element: Direction.travel
inherits from: Self motion
activates: SOURCE PATH GOAL
definition: In this frame a Traveler goes on a journey, an activity, generally planned in advance, in which the Traveler moves from a Source location to a Goal along a Path or within an Area. The journey can be accompanied by Co_participants and Baggage. The Duration or Distance of the journey, both generally long, may also be described as may be the Mode_of_transportation. Words in this frame emphasize the whole process of getting from one place to another, rather than profiling merely the beginning or the end of the journey. Ellen journeyed to Europe with five suitcases. Samantha journeyed 2500 miles with her family by sea to China.The Osbournes <m>took</m> a trip from Beverly Hills to London on the Concorde.
has lex unit: tour.n
type: NamedIndividual
has lex unit: peregrination.n
has lex unit: voyage.v
has lex unit: travel.n
has frame element: Means.travel
has frame element: Goal.travel
has frame element: Path.travel
has lex unit: trip.n
has frame element: Manner.travel
has frame element: Baggage.travel
has frame element: Period of iterations.travel
type: Frame
has lex unit: pilgrimage.n
has frame element: Co participant.travel
has lex unit: odyssey.n
has frame element: Speed.travel
inherits from: Event
has frame element: Mode of transportation.travel
has lex unit: tour.v
has frame element: Result.travel
has frame element: Period of Iterations.travel
has lex unit: getaway.n
has lex unit: journey.n
has frame element: Descriptor.travel
subclass of: Restriction
  on property: hasComponent
  some values from: Setting out
has f ecore set: travel coreSet1
inherits from: Motion
has lex unit: travel.v
has lex unit: jaunt.n
has frame element: Iterations.travel
has frame element: Time.travel
type: Class