Timespan
has frame element: Whole.timespan
definition: The words in this frame describe a period of time, as opposed to a point in time. The best time of year for planting tends to be fairly regular.
perspective on: Delimited state scenario
frame name: Timespan
has frame relation: Time period of action
type: Class
has lex unit: life.n
has lex unit: day.n
definition: <def-root>The words in this frame describe a period of time, as opposed to a point in time. <ex>The <fex name="Descriptor">best</fex> <t>time</t> <fex name="Whole">of year</fex> <fex name="State">for planting</fex> tends to be fairly regular.</ex> </def-root>
frame c by: JKs
frame ID: 2142
has lex unit: Day.n
type: Frame
is inherited by: Time period of action
subclass of: Restriction
  on property: hasComponent
  some values from: Time period of action
has frame element: Descriptor.timespan
has lex unit: time.n
has frame element: Duration.timespan
comment: The words in this frame describe a period of time, as opposed to a point in time. The best time of year for planting tends to be fairly regular.
has frame relation: Delimited state scenario
frame c date: 2009-07-06T12:52:55+02:00
has frame element: State.timespan