Text_creation
has lex unit: write down.v
has frame relation: Text
has lex unit: utter.v
has lex unit: write in.v
has frame element: Explanation.text creation
has frame element: Means.text creation
has lex unit: speak.v
has frame element: Text.text creation
subclass of: Restriction
  on property: hasComponent
  some values from: Spelling and pronouncing
has frame element: Depictive.text creation
inherits from: Intentionally create
type: Class
frame c date: 2002-02-28T14:57:56+01:00
has lex unit: author.v
has lex unit: in write.v
has lex unit: type up.v
is used by: Spelling and pronouncing
has frame element: Time.text creation
has frame element: Addressee.text creation
uses: Communication
type: Frame
definition: <def-root>An <fen>Author</fen> creates a <fen>Text</fen>, either written, such as a letter, or spoken, such as a speech, that contains meaningful linguistic tokens, and may have a particular <fen>Addressee</fen> in mind. The <fen>Text</fen> may include information about its topic, although the latter is not an FE in this frame. <ex><fex name="Author">I</fex> <t>penned</t> <fex name="Text">a letter concerning racism</fex> <fex name="Addressee">to Congress</fex>.</ex> <ex><fex name="Author">The brothers</fex> <t>said</t> <fex name="Text">not two words</fex> <fex name="Addressee">to each other</fex>.</ex> <ex><t>Jot</t> <fex name="Text">any notes you need</fex> <fex name="Place">below the line</fex> <fex name="Manner">in red pen only</fex>.</ex></def-root>
frame ID: 278
frame c by: MJE
has lex unit: print up.v
inherits from: Creating
has frame relation: Intentionally create
has lex unit: sign.v
has lex unit: jot down.v
has lex unit: pen.v
is inherited by: Sign agreement
has frame element: Manner.text creation
has lex unit: write out.v
comment: An Author creates a Text, either written, such as a letter, or spoken, such as a speech, that contains meaningful linguistic tokens, and may have a particular Addressee in mind. The Text may include information about its topic, although the latter is not an FE in this frame. I penned a letter concerning racism to Congress. The brothers said not two words to each other. Jot any notes you need below the line in red pen only.
definition: An Author creates a Text, either written, such as a letter, or spoken, such as a speech, that contains meaningful linguistic tokens, and may have a particular Addressee in mind. The Text may include information about its topic, although the latter is not an FE in this frame. I penned a letter concerning racism to Congress. The brothers said not two words to each other. Jot any notes you need below the line in red pen only.
has frame element: Honoree.text creation
has frame element: Form.text creation
has frame element: Beneficiary.text creation
has lex unit: draft.v
has frame relation: Sign agreement
has lex unit: write.v
subclass of: Intentionally create
has lex unit: type out.v
has frame element: Author.text creation
has lex unit: get down.v
has frame element: Medium.text creation
inherits from: Intentionally act
has lex unit: up write.v
is used by: Text
has frame relation: Communication
has lex unit: list.v
has lex unit: out type.v
has lex unit: print out.v
has frame element: Reason.text creation
has frame relation: Spelling and pronouncing
inherits from: Transitive action
frame name: Text_creation
has lex unit: down write.v
has lex unit: compose.v
has frame element: Instrument.text creation
has lex unit: type.v
inherits from: Event
has lex unit: out write.v
has lex unit: write up.v
has frame element: Place.text creation
has lex unit: chronicle.v
has lex unit: print.v
has lex unit: type in.v
inherits from: Objective influence
subclass of: Restriction
  on property: hasComponent
  some values from: Sign agreement
has lex unit: jot.v
has lex unit: dash off.v
has lex unit: say.v
has frame element: Components.text creation
has frame element: Purpose.text creation