Text
type: Frame
type: Class
inherits from: Entity
inherits from: Artifact
comment: A Text is an entity that contains linguistic, symbolic information on a Topic, created by an Author at the Time_of_creation. It may be a physical entity that is made of a certain Material etc. It may be constructed for an Honoree. It was a good book.
subclass of: Restriction
  on property: hasComponent
  some values from: Documents
subclass of: Artifact
narrower match: synset-epic-adjective-2
frame sectivity: sub
definition: <def-root>A <fen>Text</fen> is an entity that contains linguistic, symbolic information on a <fen>Topic</fen>, created by an <fen>Author</fen> at the <fen>Time_of_creation</fen>. It may be a physical entity that is made of a certain <fen>Material</fen> etc. It may be constructed for an <fen>Honoree</fen>.</def-root>
definition: A Text is an entity that contains linguistic, symbolic information on a Topic, created by an Author at the Time_of_creation. It may be a physical entity that is made of a certain Material etc. It may be constructed for an Honoree. It was a good book.
definition: A Text is an entity that contains linguistic, symbolic information on a Topic, created by an Author at the Time_of_creation. It may be a physical entity that is made of a certain Material etc. It may be constructed for an Honoree.
frame ID: 298
frame c by: KCo
frame c date: 2002-04-02T16:24:53+02:00
frame name: Text
has frame element: Time of creation.text
has frame element: Beneficiary.text
has frame element: Place.text
has frame element: Use.text
has frame element: Honoree.text
has frame element: Descriptor.text
has frame element: Genre.text
has frame element: Author.text
has frame element: Material.text
has frame element: Medium.text
has frame element: Containing text.text
has frame element: Title.text
has frame element: Topic.text
has frame element: Text.text
has frame element: Components.text
has frame element: Subpart.text
has frame relation: Text creation
has frame relation: Artifact
has frame relation: Documents
has frame relation: Medium
has frame relation: Law
has frame relation: Reference text
has frame relation: Records
has frame relation: Topic
has lex unit: tome.n
has lex unit: diary.n
has lex unit: handbook.n
has lex unit: monograph.n
has lex unit: hagiography.n
has lex unit: festschrift.n
has lex unit: epic.adj
has lex unit: speech.n
has lex unit: thriller.n
has lex unit: manuscript.n
has lex unit: record.n
has lex unit: essay.n
has lex unit: novella.n
has lex unit: account.n
has lex unit: novel.n
has lex unit: periodical.n
has lex unit: textbook.n
has lex unit: drama.n
has lex unit: screenplay.n
has lex unit: paperback.n
has lex unit: fable.n
has lex unit: tragedy.n
has lex unit: booklet.n
has lex unit: journal.n
has lex unit: limerick.n
has lex unit: exemplum.n
has lex unit: paper (article).n
has lex unit: sonnet.n
has lex unit: sermon.n
has lex unit: script.n
has lex unit: treatise.n
has lex unit: magazine.n
has lex unit: edition.n
has lex unit: lyric.n
has lex unit: mystery.n
has lex unit: history.n
has lex unit: whodunit.n
has lex unit: tetralogy.n
has lex unit: pamphlet.n
has lex unit: bulletin.n