Telling
has lex unit: assurance.n
frame c date: 2003-07-28T13:26:09+02:00
has frame element: Speaker.telling
has lex unit: tell.v
has frame element: Topic.telling
has frame element: Iteration.telling
type: Frame
has frame element: Descriptor.telling
has lex unit: advise.v
has frame element: Message.telling
has frame element: Time.telling
has lex unit: apprise.v
is inherited by: Suasion
has frame element: Epistemic stance.telling
has frame element: Iterations.telling
frame c by: MJE
has lex unit: assure.v
has frame relation: Suasion
has frame element: Medium.telling
has frame element: Addressee.telling
subclass of: Statement
type: Class
frame name: Telling
inherits from: Statement
has lex unit: brief.v
frame ID: 750
has frame element: Means.telling
has lex unit: notify.v
has frame element: Manner.telling
has lex unit: notification.n
has lex unit: confide.v
has frame relation: Warning
has frame element: Communicative force.telling
has lex unit: let know.null
comment: A Speaker addresses an Addressee with a Message, which may be indirectly referred to as a Topic. Instead of (or in addition to) a Speaker, a Medium may also be mentioned. I told him about the party.
is inherited by: Warning
definition: A Speaker addresses an Addressee with a Message, which may be indirectly referred to as a Topic. Instead of (or in addition to) a Speaker, a Medium may also be mentioned. I told him about the party.
has f ecore set: telling coreSet2
has f ecore set: telling coreSet1
has frame element: Place.telling
has frame relation: Statement
has lex unit: inform.v