Supply
type: Frame
type: Class
comment: A Supplier gives a Theme to a Recipient to fulfill a need or purpose (Imposed_purpose) of the Recipient. Habituating the ground nesting chimp groups is done by provisioning them with sugar cane. CNI INI I have equipped my leech troopers with tiny subspace displacement thingummies. INI She sat down on her bed, carefully folding her clothing and packing it into the small carryall Starfleet had provided her for the journey.
subclass of: Giving
inherits from: Lose possession
inherits from: Giving
inherits from: Intentionally act
inherits from: Event
inherits from: Eventive affecting
definition: A Supplier gives a Theme to a Recipient to fulfill a need or purpose (Imposed_purpose) of the Recipient. Habituating the ground nesting chimp groups is done by provisioning them with sugar cane. CNI INI I have equipped my leech troopers with tiny subspace displacement thingummies. INI She sat down on her bed, carefully folding her clothing and packing it into the small carryall Starfleet had provided her for the journey.
definition: <def-root>A <fen>Supplier</fen> gives a <fen>Theme</fen> to a <fen>Recipient</fen> to fulfill a need or purpose (<fen>Purpose_of_recipient</fen>) of the <fen>Recipient</fen>. <ex>Habituating the ground nesting chimp groups is done by <t>provisioning</t> <fex name="Recipient">them</fex> <fex name="Theme">with sugar cane</fex>. <fex name="Supplier">CNI</fex> <fex name="Purpose_of_recipient">INI</fex></ex> <ex><fex name="Supplier">I</fex> have <t>equipped</t> <fex name="Recipient">my leech troopers</fex> <fex name="Theme">with tiny subspace displacement thingummies</fex>. <fex name="Purpose_of_recipient">INI</fex></ex> <ex> She sat down on her bed, carefully folding her clothing and packing it into <fex name="Theme">the small carryall</fex> <fex name="Supplier">Starfleet</fex> had <t>provided</t> <fex name="Recipient">her</fex> <fex name="por">for the journey</fex>.</ex></def-root>
definition: A Supplier gives a Theme to a Recipient to fulfill a need or purpose (Purpose_of_recipient) of the Recipient. Habituating the ground nesting chimp groups is done by provisioning them with sugar cane. CNI INI I have equipped my leech troopers with tiny subspace displacement thingummies. INI She sat down on her bed, carefully folding her clothing and packing it into the small carryall Starfleet had provided her for the journey.
frame ID: 1346
frame c by: JKR
frame c date: 2005-03-02T16:05:56+01:00
frame name: Supply
has frame element: Recipient.supply
has frame element: Co theme.supply
has frame element: Purpose.supply
has frame element: Time.supply
has frame element: Manner.supply
has frame element: Supplier.supply
has frame element: Place.supply
has frame element: Theme.supply
has frame element: Period of iterations.supply
has frame element: Reason.supply
has frame element: Imposed purpose.supply
has frame element: Source.supply
has frame element: Explanation.supply
has frame element: Circumstances.supply
has frame element: Means.supply
has frame element: Cotheme.supply
has frame element: Purpose of recipient.supply
has frame relation: Funding
has frame relation: Giving
has lex unit: provision.v
has lex unit: outfit.v
has lex unit: equipment.n
has lex unit: issue.v
has lex unit: furnish.v
has lex unit: supply.v
has lex unit: provide.v
has lex unit: provision.n
has lex unit: equip.v
has lex unit: fuel.v
has lex unit: fix up.v
has lex unit: supplier.n
has lex unit: afford.v
has lex unit: supply.n
is inherited by: Funding