Supply
has frame element: Recipient.supply
frame c by: JKR
has lex unit: provision.v
subclass of: Giving
has frame element: Co theme.supply
has lex unit: outfit.v
has frame element: Purpose.supply
has lex unit: equipment.n
has frame element: Time.supply
type: Frame
has lex unit: issue.v
definition: A Supplier gives a Theme to a Recipient to fulfill a need or purpose (Imposed_purpose) of the Recipient. Habituating the ground nesting chimp groups is done by provisioning them with sugar cane. CNI INI I have equipped my leech troopers with tiny subspace displacement thingummies. INI She sat down on her bed, carefully folding her clothing and packing it into the small carryall Starfleet had provided her for the journey.
comment: A Supplier gives a Theme to a Recipient to fulfill a need or purpose (Imposed_purpose) of the Recipient. Habituating the ground nesting chimp groups is done by provisioning them with sugar cane. CNI INI I have equipped my leech troopers with tiny subspace displacement thingummies. INI She sat down on her bed, carefully folding her clothing and packing it into the small carryall Starfleet had provided her for the journey.
inherits from: Giving
has lex unit: furnish.v
has frame element: Manner.supply
has frame element: Supplier.supply
has lex unit: supply.v
inherits from: Lose possession
has frame element: Place.supply
has lex unit: provide.v
type: Class
has frame relation: Funding
has frame relation: Giving
has frame element: Theme.supply
inherits from: Intentionally act
has frame element: Period of iterations.supply
has lex unit: provision.n
has frame element: Reason.supply
has frame element: Imposed purpose.supply
has lex unit: equip.v
definition: <def-root>A <fen>Supplier</fen> gives a <fen>Theme</fen> to a <fen>Recipient</fen> to fulfill a need or purpose (<fen>Purpose_of_recipient</fen>) of the <fen>Recipient</fen>. <ex>Habituating the ground nesting chimp groups is done by <t>provisioning</t> <fex name="Recipient">them</fex> <fex name="Theme">with sugar cane</fex>. <fex name="Supplier">CNI</fex> <fex name="Purpose_of_recipient">INI</fex></ex> <ex><fex name="Supplier">I</fex> have <t>equipped</t> <fex name="Recipient">my leech troopers</fex> <fex name="Theme">with tiny subspace displacement thingummies</fex>. <fex name="Purpose_of_recipient">INI</fex></ex> <ex> She sat down on her bed, carefully folding her clothing and packing it into <fex name="Theme">the small carryall</fex> <fex name="Supplier">Starfleet</fex> had <t>provided</t> <fex name="Recipient">her</fex> <fex name="por">for the journey</fex>.</ex></def-root>
is inherited by: Funding
has lex unit: fuel.v
has lex unit: fix up.v
definition: A Supplier gives a Theme to a Recipient to fulfill a need or purpose (Purpose_of_recipient) of the Recipient. Habituating the ground nesting chimp groups is done by provisioning them with sugar cane. CNI INI I have equipped my leech troopers with tiny subspace displacement thingummies. INI She sat down on her bed, carefully folding her clothing and packing it into the small carryall Starfleet had provided her for the journey.
has frame element: Source.supply
frame ID: 1346
has frame element: Explanation.supply
inherits from: Event
has lex unit: supplier.n
has frame element: Circumstances.supply
frame c date: 2005-03-02T16:05:56+01:00
frame name: Supply
has lex unit: afford.v
has frame element: Means.supply
inherits from: Eventive affecting
has lex unit: supply.n
has frame element: Cotheme.supply
has frame element: Purpose of recipient.supply