Statement
type: Class
type: Frame
comment: This frame contains verbs and nouns that communicate the act of a Speaker to address a Message to some Addressee using language. Instead of (or in addition to) a Speaker, a Medium may also be mentioned. Likewise, a Topic may be stated instead of a Message. A number of the words can be used performatively, such as declare and insist. I now declare you members of this Society. She said that I would be late . The announcement about raffle winners came across the loudspeaker.
subclass of: Restriction
  on property: hasComponent
  some values from: Unattributed information
definition: This frame contains verbs and nouns that communicate the act of a Speaker to address a Message to some Addressee using language. Instead of (or in addition to) a Speaker, a Medium may also be mentioned. Likewise, a Topic may be stated instead of a Message. A number of the words can be used performatively, such as declare and insist. I now declare you members of this Society. She said that I would be late . The announcement about raffle winners came across the loudspeaker.
frame ID: 43
frame c by: ChW
frame c date: 2001-02-07T13:12:04+01:00
frame name: Statement
has f ecore set: statement coreSet2
has f ecore set: statement coreSet1
has frame element: Frequency.statement
has frame element: Topic.statement
has frame element: Containing event.statement
has frame element: Iterations.statement
has frame element: Occasion.statement
has frame element: Place.statement
has frame element: Depictive.statement
has frame element: Time.statement
has frame element: Group.statement
has frame element: Event description.statement
has frame element: Medium.statement
has frame element: Manner.statement
has frame element: Internal cause.statement
has frame element: Message.statement
has frame element: Means.statement
has frame element: Speaker.statement
has frame element: Communicative force.statement
has frame element: Particular iteration.statement
has frame element: Epistemic stance.statement
has frame element: Iteration.statement
has frame element: Addressee.statement
has frame element: Degree.statement
has frame relation: Recording
has frame relation: Predicting
has frame relation: Affirm or deny
has frame relation: Reading aloud
has frame relation: Renunciation
has frame relation: Judgment communication
has frame relation: Reveal secret
has frame relation: Attributed information
has frame relation: Complaining
has frame relation: Communication
has frame relation: Telling
has frame relation: Chatting
has frame relation: Adducing
has frame relation: Unattributed information
has lex unit: concession.n
has lex unit: claim.n
has lex unit: acknowledgment.n
has lex unit: preach.v
has lex unit: pronounce.v
has lex unit: profess.v
has lex unit: declare.v
has lex unit: report.n
has lex unit: mention.v
has lex unit: challenge.v
has lex unit: explain.v
has lex unit: allegation.n
has lex unit: be like.v
has lex unit: claim.v
has lex unit: recount.v
has lex unit: describe.v
has lex unit: affirmation.n
has lex unit: reaffirm.v
has lex unit: report.v
has lex unit: maintain.v
has lex unit: suggest.v
has lex unit: address.v
has lex unit: relate.v
has lex unit: remark.v
has lex unit: conjecture.v
has lex unit: concede.v
has lex unit: comment.n
has lex unit: contention.n
has lex unit: speak.v
has lex unit: announcement.n
has lex unit: state.v
has lex unit: hazard.v
has lex unit: venture.v