Self_motion
has lex unit: barge.v
has f ecore set: self motion coreSet1
has lex unit: meander.v
has lex unit: amble.v
has lex unit: skim.v
has lex unit: stroll.v
has frame element: Manner.self motion
has lex unit: sprint.v
has lex unit: coast.v
has lex unit: file.v
has lex unit: trip.v
has lex unit: sail.v
has lex unit: hitchhike.v
has frame element: Source.self motion
subclass of: Restriction
  on property: hasComponent
  some values from: Body movement
has lex unit: hike.n
has lex unit: march.v
has lex unit: bop.v
has lex unit: slither.v
has frame element: Area.self motion
inherits from: Intentionally act
has lex unit: dart.v
has lex unit: walk.v
has lex unit: skulk.v
has lex unit: lurch.v
has lex unit: step.n
has frame relation: Motion
has lex unit: slink.v
has frame element: Concessive.self motion
has frame element: External cause.self motion
has lex unit: tiptoe.v
has lex unit: flounce.v
has lex unit: dash.v
has lex unit: whisk.v
has lex unit: romp.v
has lex unit: clomp.v
frame ID: 64
inherits from: Motion
has lex unit: spring.v
has frame element: Time.self motion
has lex unit: tramp.v
has lex unit: hop.v
has lex unit: canter.v
has lex unit: swing.v
has frame element: Reason.self motion
has lex unit: lumber.v
has lex unit: bustle.v
has lex unit: vault.v
has lex unit: stumble.v
definition: <def-root>The <fen>Self_mover</fen>, a living being, moves under its own power in a directed fashion, i.e. along what could be described as a <fen>Path</fen>, with no separate vehicle.</def-root>
has lex unit: hasten.v
has lex unit: frolic.v
has lex unit: clamber.v
has lex unit: sashay.v
has lex unit: swim.n
has frame element: Speed.self motion
type: Class
has lex unit: scramble.v
subclass of: Intentionally act
has lex unit: slalom.v
has frame relation: Intentionally act
has lex unit: tack.v
has lex unit: caper.v
has lex unit: take to the air.v
has lex unit: shuffle.n
has lex unit: slip.v
has lex unit: repair.v
has lex unit: shuffle.v
has frame element: Result.self motion
inherits from: Event
has lex unit: drive.v
has lex unit: stride.v
has lex unit: swagger.v
has lex unit: storm.v
has lex unit: parade.v
has lex unit: tread.v
see also: Motion
has lex unit: enroute.adj
has frame element: Goal.self motion
has frame element: Means.self motion