Scrutiny
subclass of: Restriction
  on property: hasComponent
  some values from: Seeking
definition: <def-root>This frame concerns a <fen>Cognizer</fen> (a person or other intelligent being) paying close attention to something, the <fen>Ground</fen>, in order to discover and note its salient characteristics. The <fen>Cognizer</fen> may be interested in a particular characteristic or entity, the <fen>Phenomenon</fen>, that belongs to the <fen>Ground</fen> or is contained in the <fen>Ground</fen> (or to ensure that such a property of entity is not present). Some words in this frame allow alternate expressions of the <fen>Ground</fen>and the <fen>Phenomenon</fen>: <ex>We <t>searched</t> <fex name="Ground">the yard</fex> <fex name="Phen"> for my contact lens</fex>.</ex></def-root>
has lex unit: reconnaissance.n
has frame element: Degree.scrutiny
has lex unit: survey.n
type: Class
has lex unit: study.v
has lex unit: reconnoitre.v
is inherited by: Reading
has lex unit: peruse.v
has lex unit: reconnoiter.v
has lex unit: surveillance ((entity)).n
has frame element: Time.scrutiny
has lex unit: investigation.n
has lex unit: comb.v
is used by: Experimentation
has lex unit: scrutinize.v
type: Frame
has lex unit: examine.v
has lex unit: monitor.v
has lex unit: scan.v
has lex unit: pry.v
has lex unit: analytic.adj
has lex unit: analyse.v
has lex unit: frisk.v
frame sectivity: sub
is inherited by: Reading perception
has lex unit: monitoring.n
has frame element: Medium.scrutiny
has lex unit: sweep.v
has frame element: Cognizer.scrutiny
has lex unit: proof-read.v
has lex unit: perusal.n
has lex unit: rummage.v
has lex unit: go ((through)).v
has lex unit: explore.v
see also: Seeking
has lex unit: sweep.n
has lex unit: sift.v
has lex unit: surveyor.n
has lex unit: go.v
has frame relation: Scrutinizing for
has lex unit: double-check.v
has lex unit: assay.v
has frame element: Instrument.scrutiny
has frame relation: Perception active
has lex unit: skim.v
comment: This frame concerns a Cognizer (a person or other intelligent being) paying close attention to something, the Ground, in order to discover and note its salient characteristics. The Cognizer may be interested in a particular characteristic or entity, the Phenomenon, that belongs to the Ground or is contained in the Ground (or to ensure that such a property of entity is not present). Some words in this frame allow alternate expressions of the Groundand the Phenomenon: We searched the yard for my contact lens.
has frame element: Ground.scrutiny
frame name: Scrutiny
has frame relation: Experimentation
has lex unit: search.v
has lex unit: surveillance.n
frame c by: ChW
has lex unit: ransack.v
has lex unit: check.v
has frame element: Direction.scrutiny
definition: This frame concerns a Cognizer (a person or other intelligent being) paying close attention to something, the Ground, in order to discover and note its salient characteristics. The Cognizer may be interested in a particular characteristic or entity, the Phenomenon, that belongs to the Ground or is contained in the Ground (or to ensure that such a property of entity is not present). Some words in this frame allow alternate expressions of the Groundand the Phenomenon: We searched the yard for my contact lens.
has lex unit: search.n
has lex unit: eyeball.v
has lex unit: look.v
is inherited by: Scrutinizing for
has lex unit: rifle.v
frame ID: 31
has lex unit: analytic.a
narrower match: synset-analytic-adjective-2
has frame relation: Reading perception
has frame relation: Seeking
has lex unit: unmonitored.a
uses: Becoming aware
has lex unit: analysis.n
triggers: Analysis
has lex unit: spy out the land.v
has lex unit: scrutiny.n
has lex unit: analyst.n
has lex unit: investigate.v
has lex unit: examination.n
has frame relation: Research
has lex unit: once-over.n