Residence
has frame element: Manner.residence
has frame relation: People by residence
type: Frame
has lex unit: shack up.v
has lex unit: dweller.n
is used by: Colonization
definition: <def-root>This frame has to do with people (the <fen>Resident</fen>s) residing in <fen>Location</fen>s, sometimes with a <fen>Co-resident</fen>. <ex><fex name="Resident">Peter</fex> <t>lives</t> <fex name="Location">in New York</fex>.</ex> <ex><fex name="Resident">Sue</fex> <m>is</m> an <t>inhabitant</t> <fex name="Location">of Los Angeles</fex>.</ex></def-root>
has lex unit: bivouac.v
has frame element: Resident.residence
definition: This frame has to do with people (the Residents) residing in Locations, sometimes with a Co-resident. Peter lives in New York. Sue <m>is</m> an inhabitant of Los Angeles.
has lex unit: occupant.n
has frame element: Time.residence
has lex unit: lodge.v
has lex unit: camp.n
has lex unit: live.v
is inherited by: Temporary stay
subclass of: Restriction
  on property: hasComponent
  some values from: Colonization
has lex unit: inhabit.v
has lex unit: room-mate.n
is used by: People by residence
definition: This frame has to do with people (the Residents) residing in Locations, sometimes with a Co-resident. Peter lives in New York. Sue is an inhabitant of Los Angeles.
comment: This frame has to do with people (the Residents) residing in Locations, sometimes with a Co-resident. Peter lives in New York. Sue is an inhabitant of Los Angeles.
has frame relation: Colonization
has lex unit: dwell.v
has lex unit: bivouac.n
has lex unit: tenant.n
has lex unit: stay.v
has lex unit: squatter.n
has lex unit: camped.a
subclass of: Restriction
  on property: hasComponent
  some values from: People by residence
subclass of: Restriction
  on property: hasComponent
  some values from: Temporary stay
has frame element: Frequency.residence
has f ecore set: residence coreSet1
type: Class
has lex unit: occupy.v
has lex unit: reside.v
has frame element: Circumstances.residence
has lex unit: room.v
has frame element: Depictive.residence
has lex unit: camped.adj
frame ID: 110
has lex unit: resident.n
has frame element: Location.residence
has lex unit: inhabitant.n
has frame relation: Temporary stay
has lex unit: camp.v
has frame element: Co resident.residence
has frame element: Means.residence
frame c by: JKR
frame c date: 2001-05-22T18:51:11+02:00
has lex unit: camper.n
frame name: Residence
has lex unit: squat.v