Removing
has lex unit: ejection.n
has lex unit: extraction.n
type: Frame
precedes: Placing
has frame element: Means.removing
has lex unit: expel.v
type: Class
has frame relation: Transitive action
is used by: Dunking
has frame relation: Dunking
subclass of: Transitive action
has lex unit: cut.v
uses: Motion
has lex unit: dust.v
has lex unit: eviction.n
has frame element: Goal.removing
has lex unit: skim.v
has frame element: Explanation.removing
has lex unit: evict.v
has frame relation: Removing scenario
has lex unit: eliminate.v
has frame relation: Placing
has lex unit: weed.v
has frame element: Cause.removing
has frame element: Subevent.removing
has lex unit: strip.v
has f ecore set: removing coreSet1
has lex unit: expunge.v
has lex unit: evacuation.n
has lex unit: pluck.v
inherits from: Transitive action
has lex unit: prise.v
has lex unit: amputate.v
has lex unit: empty.v
subframe of: Cause motion
has frame element: Cotheme.removing
has lex unit: expurgate.v
has frame element: Degree.removing
inherits from: Objective influence
has frame element: Time.removing
has frame element: Instrument.removing
has frame element: Co-timed event.removing
has lex unit: rip.v
has lex unit: snatch.v
comment: An Agent causes a Theme to move away from a location, the Source. The Sourceis profiled by the words in this frame, just as the Goal is profiled in the Placing frame. I saw that several men in dark suits had removed all of the evidence from the scene. With your index finger prise the meat out of the shell The torrential winds dislodged most of the roof tiles.
has lex unit: removal.n
has frame element: Manner.removing
has lex unit: purge.v
has lex unit: discard.v
has frame element: Result.removing
has lex unit: elimination.n
has lex unit: swipe.v
has lex unit: dislodge.v
has lex unit: roust.v
has lex unit: take.v
has lex unit: withdrawal.n
has lex unit: drain.v
has frame element: Vehicle.removing
definition: An Agent causes a Theme to move away from a location, the Source. The Sourceis profiled by the words in this frame, just as the Goal is profiled in the Placing frame. I saw that several men in dark suits had removed all of the evidence from the scene. With your index finger prise the meat out of the shell The torrential winds dislodged most of the roof tiles.
has lex unit: extract.v
frame name: Removing
has lex unit: excise.v
has frame element: Distance.removing
is used by: Undressing
has frame relation: Undressing
frame c date: 2001-02-07T13:12:16+01:00
has lex unit: oust.v
has lex unit: evacuate.v
has lex unit: scrape.v
has frame relation: Motion
has frame element: Agent.removing
has frame element: Source.removing
has frame element: Direction.removing
frame c by: ChW
inherits from: Event
has frame relation: Cause motion
has frame element: Depictive.removing
has frame element: Circumstances.removing
has lex unit: withdraw.v