Quantity
type: Frame
type: ConceptualFrame
type: Class
type: NamedIndividual
comment: This frame contains nouns denoting Quantities of a specified Entity and their numerical Values. Note that the nouns in this frame DO NOT convey a gradable amount on thier own. His heart attack was caused by a high cholesterol level. His cholesterol level was 124 mg/dL.
subclass of: FrameOccurrence
subclass of: Restriction
  on property: hasComponent
  some values from: Relational quantity
narrower match: synset-several-adjectivesatellite-1
narrower match: synset-all-adjective-1
narrower match: synset-fair-adjectivesatellite-2
narrower match: synset-no-adjective-1
narrower match: synset-numerous-adjectivesatellite-1
narrower match: synset-many-adjective-1
narrower match: synset-any-adjectivesatellite-1
narrower match: synset-multiple-adjective-1
narrower match: synset-few-adjective-1
narrower match: synset-both-adjectivesatellite-1
frame other feature: scalar
frame sectivity: inter
definition: This frame contains nouns denoting Quantities of a specified Entity and their numerical Values. Note that the nouns in this frame DO NOT convey a gradable amount on thier own. His heart attack was caused by a high cholesterol level. His cholesterol level was 124 mg/dL.
definition: <def-root>This frame contains transparent nouns (and some adjectives) denoting quantities of a <fen>Mass</fen> or of <fen>Individuals</fen>. As opposed to aggregate words such as group, set, these <fen>Quantity</fen> do not have a status as Wholes on their own. Initially, at least, we annotate both <fen>Quantity</fen> of <fen>Mass</fen>es and of <fen>Individuals</fen> in this frame, though we may split the frame along these lines later on. <ex>He found them in the <fex name="Quantity"><t>deluge</t></fex> <fex name="Individuals">of papers</fex> on his desk.</ex></def-root>
definition: This frame contains transparent nouns (and some adjectives) denoting quantities of a Mass or of Individuals. As opposed to aggregate words such as group, set, these Quantity do not have a status as Wholes on their own. Initially, at least, we annotate both Quantity of Masses and of Individuals in this frame, though we may split the frame along these lines later on. He found them in the deluge of papers on his desk.
frame ID: 2604
frame c by: MLC
frame c date: 2011-08-08T11:42:38+02:00
frame name: Quantity
has frame element: Q Prop.quantity
has frame element: Degree.quantity
has frame element: Descriptor.quantity
has frame element: Mass.quantity
has frame element: Individuals.quantity
has frame element: Entity.quantity
has frame element: Quantity.quantity
has frame element: Value.quantity
has frame relation: Quantified mass
has frame relation: Dimension
has lex unit: wave.n
has lex unit: quantity.n
has lex unit: mountain.n
has lex unit: level.n
has lex unit: a few.art
has lex unit: flood.n
has lex unit: several.a
has lex unit: heap.n
has lex unit: smattering.n
has lex unit: mite.n
has lex unit: scads.n
has lex unit: numerous.a
has lex unit: a bit.a
has lex unit: millions.n
has lex unit: no.a
has lex unit: shitload.n
has lex unit: amount.n
has lex unit: few.a
has lex unit: abundance.n
has lex unit: billions.n
has lex unit: all.a
has lex unit: measure.n
has lex unit: multiple.a
has lex unit: ton.n
has lex unit: degree.n
has lex unit: mass.n
has lex unit: ounce.n
has lex unit: few.n
has lex unit: myriad.n
has lex unit: raft.n
has lex unit: trickle.n
has lex unit: scores.n
has lex unit: deluge.n
has lex unit: pinch.n
has lex unit: dose.n
has lex unit: plethora.n
has lex unit: pile.n
has lex unit: both.a
has lex unit: a lot.n
has lex unit: torrent.n
has lex unit: load.n
has lex unit: avalanche.n
has lex unit: many.a
has lex unit: any.a