Quantity
narrower match: synset-several-adjectivesatellite-1
inherits from: Dimension
type: Frame
narrower match: synset-all-adjective-1
has lex unit: wave.n
definition: This frame contains nouns denoting Quantities of a specified Entity and their numerical Values. Note that the nouns in this frame DO NOT convey a gradable amount on thier own. His heart attack was caused by a high cholesterol level. His cholesterol level was 124 mg/dL.
frame ID: 2604
has lex unit: quantity.n
has lex unit: mountain.n
has lex unit: level.n
has lex unit: a few.art
has lex unit: flood.n
has lex unit: several.a
has lex unit: heap.n
has lex unit: smattering.n
has lex unit: mite.n
has lex unit: scads.n
narrower match: synset-fair-adjectivesatellite-2
has lex unit: numerous.a
has lex unit: a bit.a
narrower match: synset-no-adjective-1
comment: This frame contains nouns denoting Quantities of a specified Entity and their numerical Values. Note that the nouns in this frame DO NOT convey a gradable amount on thier own. His heart attack was caused by a high cholesterol level. His cholesterol level was 124 mg/dL.
has lex unit: millions.n
has lex unit: no.a
see also: Quantified mass
has lex unit: shitload.n
has lex unit: amount.n
has frame element: Q Prop.quantity
has lex unit: few.a
has frame element: Degree.quantity
definition: <def-root>This frame contains transparent nouns (and some adjectives) denoting quantities of a <fen>Mass</fen> or of <fen>Individuals</fen>. As opposed to aggregate words such as group, set, these <fen>Quantity</fen> do not have a status as Wholes on their own. Initially, at least, we annotate both <fen>Quantity</fen> of <fen>Mass</fen>es and of <fen>Individuals</fen> in this frame, though we may split the frame along these lines later on. <ex>He found them in the <fex name="Quantity"><t>deluge</t></fex> <fex name="Individuals">of papers</fex> on his desk.</ex></def-root>
type: ConceptualFrame
has lex unit: abundance.n
narrower match: synset-numerous-adjectivesatellite-1
frame other feature: scalar
definition: This frame contains transparent nouns (and some adjectives) denoting quantities of a Mass or of Individuals. As opposed to aggregate words such as group, set, these Quantity do not have a status as Wholes on their own. Initially, at least, we annotate both Quantity of Masses and of Individuals in this frame, though we may split the frame along these lines later on. He found them in the deluge of papers on his desk.
has lex unit: billions.n
has lex unit: all.a
has lex unit: measure.n
has lex unit: multiple.a
has lex unit: ton.n
frame name: Quantity
has lex unit: degree.n
has lex unit: mass.n
has lex unit: ounce.n
has frame element: Descriptor.quantity
has lex unit: few.n
has lex unit: myriad.n
subclass of: Restriction
  on property: hasComponent
  some values from: Relational quantity
has lex unit: raft.n
has lex unit: trickle.n
narrower match: synset-many-adjective-1
frame sectivity: inter
has lex unit: scores.n
type: Class
has lex unit: deluge.n
perspective on: Measure scenario
has lex unit: pinch.n
has lex unit: dose.n
has lex unit: plethora.n
has lex unit: pile.n
has lex unit: both.a
has lex unit: a lot.n
narrower match: synset-any-adjectivesatellite-1
narrower match: synset-multiple-adjective-1
has lex unit: torrent.n
narrower match: synset-few-adjective-1
has lex unit: load.n
frame c by: MLC
has lex unit: avalanche.n
is inherited by: Relational quantity
has lex unit: many.a
has lex unit: any.a
subclass of: FrameOccurrence
has frame relation: Quantified mass
has lex unit: touch.n
has lex unit: number.n
has lex unit: thousands.n
has frame element: Mass.quantity
has lex unit: oodles.n