Process
type: Frame
type: Class
comment: This frame describes a complex event which lasts some amount of time, consisting of a beginning stage, a stage where the process is ongoing, and a finish or end. In some cases the process may pause, and then possibly resume. In this frame and its subframes, the distinguished argument is a Process, and there is no reference to an Entity which undergoes this Process or an Agent which initiates this Process. In formal terms, this frame refers to an overall controller x-schema (Narayanan 1997) with subframes corresponding to parts of the x-schema. I'm in the process of writing it down.
subclass of: Restriction
  on property: hasComponent
  some values from: Arraignment
subclass of: Restriction
  on property: hasComponent
  some values from: Process uncompleted state
subclass of: Restriction
  on property: hasComponent
  some values from: Process resume
subclass of: Restriction
  on property: hasComponent
  some values from: Progress
subclass of: Restriction
  on property: hasComponent
  some values from: Process end
subclass of: Restriction
  on property: hasComponent
  some values from: Process stopped state
subclass of: Restriction
  on property: hasComponent
  some values from: Process stop
subclass of: Restriction
  on property: hasComponent
  some values from: Temporal pattern
subclass of: Restriction
  on property: hasComponent
  some values from: Precipitation
subclass of: Restriction
  on property: hasComponent
  some values from: Process continue
subclass of: Restriction
  on property: hasComponent
  some values from: Process initial state
subclass of: Restriction
  on property: hasComponent
  some values from: Process completed state
subclass of: Restriction
  on property: hasComponent
  some values from: Process start
subclass of: Restriction
  on property: hasComponent
  some values from: Activity
subclass of: Restriction
  on property: hasComponent
  some values from: Process pause
definition: This frame describes a complex event which lasts some amount of time, consisting of a beginning stage, a stage where the process is ongoing, and a finish or end. In some cases the process may pause, and then possibly resume. In this frame and its subframes, the distinguished argument is a Process, and there is no reference to an Entity which undergoes this Process or an Agent which initiates this Process. In formal terms, this frame refers to an overall controller x-schema (Narayanan 1997) with subframes corresponding to parts of the x-schema. I'm in the process of writing it down.
definition: <def-root>This frame describes a complex event which lasts some amount of time, consisting of a beginning stage, a stage where the process is ongoing, and a finish or end. In some cases the process may pause, and then possibly resume. In this frame and its subframes, the distinguished argument is a <fen>Process</fen>, and there is no reference to an Entity which undergoes this <fen>Process</fen> or an Agent which initiates this <fen>Process</fen>. In formal terms, this frame refers to an overall controller x-schema (Narayanan 1997) with subframes corresponding to parts of the x-schema. </def-root>
definition: This frame describes a complex event which lasts some amount of time, consisting of a beginning stage, a stage where the process is ongoing, and a finish or end. In some cases the process may pause, and then possibly resume. In this frame and its subframes, the distinguished argument is a Process, and there is no reference to an Entity which undergoes this Process or an Agent which initiates this Process. In formal terms, this frame refers to an overall controller x-schema (Narayanan 1997) with subframes corresponding to parts of the x-schema.
frame ID: 233
frame c by: MJE
frame c date: 2001-09-27T15:36:09+02:00
frame name: Process
has frame element: Manner.process
has frame element: Process.process
has frame element: Explanation.process
has frame element: Time.process
has frame element: Result.process
has frame element: Cause.process
has frame element: Place.process
has frame element: Duration.process
has frame relation: Process start
has frame relation: Process completed state
has frame relation: Process stopped state
has frame relation: Process pause
has frame relation: Process continue
has frame relation: Precipitation
has frame relation: Process resume
has frame relation: Process uncompleted state
has frame relation: Process stop
has frame relation: Arraignment
has frame relation: Temporal pattern
has frame relation: Progression
has frame relation: Process end
has frame relation: Process initial state
has frame relation: Activity
has lex unit: process.n
has subframe: Process start
has subframe: Process end
has subframe: Process continue
has subframe: Process initial state
has subframe: Process stop
has subframe: Process uncompleted state
has subframe: Process resume
has subframe: Process stopped state
has subframe: Process completed state
has subframe: Process pause
is inherited by: Precipitation
is inherited by: Activity
is inherited by: Arraignment
is used by: Progress
is used by: Progression
is used by: Temporal pattern