Possession
type: Frame
type: Class
comment: An Owner has (or lacks) a Possession. The river's part of my manor, but of course it also belongs to the River Police. It's a nuisance having to abandon my belongings, though.
subclass of: Restriction
  on property: hasComponent
  some values from: Change of quantity of possession
subclass of: Restriction
  on property: hasComponent
  some values from: Post getting
subclass of: Restriction
  on property: hasComponent
  some values from: Locale by ownership
subclass of: Restriction
  on property: hasComponent
  some values from: Post transfer
narrower match: synset-lacking-adjectivesatellite-2
narrower match: synset-deficient-adjectivesatellite-1
frame other feature: rel
frame sectivity: sub
definition: <def-root>An <fen>Owner</fen> has (or lacks) a <fen>Possession</fen>.</def-root>
definition: An Owner has (or lacks) a Possession. The river's part of my manor, but of course it also belongs to the River Police. It's a nuisance having to abandon my belongings, though.
definition: An Owner has (or lacks) a Possession.
frame ID: 118
frame c by: MJE
frame c date: 2001-05-25T21:14:14+02:00
frame name: Possession
has frame element: Owner.possession
has frame element: Possession.possession
has frame element: Duration.possession
has frame element: Time.possession
has frame element: Explanation.possession
has frame element: Manner.possession
has frame element: Depictive.possession
has frame relation: Post getting
has frame relation: Retaining
has frame relation: Pre transfer
has frame relation: Change of quantity of possession
has frame relation: Pre lose possession
has frame relation: Locale by ownership
has frame relation: Post transfer
has frame relation: Wealthiness
has frame relation: Capital stock
has frame relation: Post lose possession
has frame relation: Getting
has frame relation: Pre getting
has frame relation: Sacrificing for
has frame relation: Prevent or allow possession
has inchoative: Getting
has lex unit: owner.n
has lex unit: own.v
has lex unit: lack.v
has lex unit: lack.n
has lex unit: lacking.a
has lex unit: possession of goods.n
has lex unit: wanting.adj
has lex unit: possess.v
has lex unit: possession.n
has lex unit: belong.v
has lex unit: belongings.n
has lex unit: definite possession.n
has lex unit: possessor.n
has lex unit: effects.n
has lex unit: wanting.a
has lex unit: lacking.adj
has lex unit: want.v
has lex unit: property.n
has lex unit: custody.n
has lex unit: ownership.n
has lex unit: assets.n
has lex unit: got.v
has lex unit: have got.v
has lex unit: have.v
has lex unit: want.n
is inchoative of: Getting
is inherited by: Pre transfer
is inherited by: Pre lose possession
is inherited by: Post lose possession
is inherited by: Post getting
is inherited by: Pre getting
is inherited by: Post transfer
is inherited by: Retaining
is used by: Capital stock
is used by: Prevent from having
is used by: Sacrificing for
is used by: Wealthiness
is used by: Locale by ownership
is used by: Prevent or allow possession
is used by: Change of quantity of possession