Political_locales
has frame relation: Economy
has lex unit: village.n
has frame relation: People by jurisdiction
has lex unit: federal.adj
has lex unit: jurisdiction.n
subclass of: Restriction
  on property: hasComponent
  some values from: People by jurisdiction
has lex unit: territorial.adj
has frame relation: Leadership
has lex unit: country.n
has lex unit: locality.n
narrower match: synset-national-adjective-1
has lex unit: borough.n
has lex unit: city-state.n
has lex unit: fiefdom.n
has lex unit: barony.n
has frame relation: Foreign or domestic country
has frame element: Relative location.political locales
has lex unit: global.a
has frame element: Descriptor.political locales
narrower match: synset-multinational-adjectivesatellite-1
type: Class
type: Frame
is used by: People by jurisdiction
has lex unit: national.adj
has lex unit: empire.n
has lex unit: international.adj
has frame element: Population.political locales
has frame element: Constituent parts.political locales
has lex unit: international.a
has lex unit: municipal.adj
has lex unit: realm.n
definition: This frame covers words that name Locations as defined politically, or administratively. Berkeley is a wonderful city.
has frame relation: Relational political locales
frame sectivity: inter
subclass of: Locale by ownership
has lex unit: town.n
has lex unit: land.n
has lex unit: municipal.a
is inherited by: Relational political locales
has lex unit: state.n
has lex unit: multinational.a
has lex unit: world.n
has lex unit: diocese.n
has lex unit: township.n
has lex unit: viscountcy.n
uses: Leadership
frame ID: 195
narrower match: synset-global-adjectivesatellite-1
has lex unit: multinational.adj
has lex unit: commonwealth.n
definition: <def-root>This frame covers words that name Locations as defined politically, or administratively. </def-root>
inherits from: Locale
narrower match: synset-municipal-adjective-1
has frame element: Name.political locales
has lex unit: megalopolis.n
has lex unit: kingdom.n
has lex unit: internationally.adv
inherits from: Locale by ownership
has frame element: Locale.political locales
has lex unit: federal.a
has lex unit: nation.n
is used by: Economy
has lex unit: municipality.n
comment: This frame covers words that name Locations as defined politically, or administratively. Berkeley is a wonderful city.
narrower match: synset-international-adjective-1
narrower match: synset-federal-adjectivesatellite-1
has lex unit: district.n
has lex unit: local.adj
frame c date: 2001-08-08T18:00:03+02:00
has frame element: Container possessor.political locales
has lex unit: principality.n
narrower match: synset-local-adjective-1
has lex unit: city.n
definition: This frame covers words that name Locations as defined politically, or administratively.
has lex unit: national.a
has lex unit: local.a
has lex unit: global.adj
has frame relation: Locale by ownership
has lex unit: province.n
has lex unit: provincial.adj