Personal_relationship
has lex unit: relationship.n
has lex unit: divorcee.n
has lex unit: spinster.n
frame name: Personal_relationship
has lex unit: pal.n
has lex unit: paramour.n
has lex unit: chummy.adj
type: Class
has lex unit: buddy.n
has lex unit: adultery.n
narrower match: synset-alienated-adjectivesatellite-2
has lex unit: single.a
has lex unit: estranged.adj
has frame element: Depictive.personal relationship
has lex unit: divorced.a
has lex unit: engagement.n
narrower match: synset-divorced-adjectivesatellite-1
has lex unit: fiancée.n
has lex unit: cohabitation.n
has lex unit: lover.n
has frame element: Source of relationship.personal relationship
has frame element: Duration.personal relationship
has frame relation: Forming relationships
has frame element: Relationship.personal relationship
has lex unit: boyfriend.n
has lex unit: sleep (with).v
definition: The words in this frame have to do with people and the personal Relationships they are or can be a part of. Some of the words denote people engaged in a particular kind of Relationship, others denote the Relationship, yet others the events bringing about or ending the Relationships. Many of the words presuppose an understanding of states and events that must have occurred before another event takes place or before a person can be classified in a certain way. And of course that drippy boyfriend of hers backed her up. As the happy couple took their places there was a stir and a rising babble behind them. Pattie is living proof that if you live with a man, you discover a lot you didn't know when you were just dating him.
has lex unit: widow.n
has lex unit: fiancé.n
has lex unit: wife.n
has lex unit: partner.n
has lex unit: betrothed.n
has lex unit: familiar.a
narrower match: synset-engaged-adjectivesatellite-1
has lex unit: cobber.n
has lex unit: spousal.a
frame c date: 2001-04-30T21:55:11+02:00
frame other feature: rel
has lex unit: romance.n
has lex unit: date.v
has lex unit: engaged.a
definition: The words in this frame have to do with people and the personal Relationships they are or can be a part of. Some of the words denote people engaged in a particular kind of Relationship, others denote the Relationship, yet others the events bringing about or ending the Relationships. Many of the words presuppose an understanding of states and events that must have occurred before another event takes place or before a person can be classified in a certain way.
has lex unit: befriend.v
has frame element: Partners.personal relationship
has frame element: Partner 1.personal relationship
has lex unit: friend.n
has lex unit: husband.n
has lex unit: couple.n
has lex unit: companion.n
has lex unit: sleep.v
narrower match: synset-unmarried-adjective-1
has lex unit: seeing.v
has lex unit: single.adj
has lex unit: bachelor.n
has lex unit: affianced.adj
has lex unit: widowed.a
has lex unit: marital.a
has lex unit: spouse.n
has frame element: Manner.personal relationship
uses: Relation between individuals
has lex unit: crush.n
narrower match: synset-widowed-adjectivesatellite-1
narrower match: synset-marital-adjective-1
has lex unit: married.adj
subclass of: Restriction
  on property: hasComponent
  some values from: Forming relationships
narrower match: synset-familiar-adjectivesatellite-4
has lex unit: inamorata.n
has lex unit: engaged.adj
has lex unit: mate.n
has frame element: Partner 2.personal relationship
has lex unit: widow.v
has inchoative: Forming relationships
has lex unit: widowed.adj
has lex unit: beau.n
has lex unit: girlfriend.n
narrower match: synset-bespoken-adjectivesatellite-2
has lex unit: cohabit.v
frame c by: JKR
has lex unit: suitor.n
has lex unit: significant other.n