Performers_and_roles
has frame element: Place.performers and roles
has lex unit: co-star.v
has frame element: Score.performers and roles
has frame element: Event description.performers and roles
is used by: Performers
has lex unit: be.v
has lex unit: lead.n
has frame element: Performer2.performers and roles
type: Non-perspectivalized frame
type: Frame
has frame element: Time.performers and roles
has lex unit: star (in).v
frame c date: 2002-10-08T15:09:37+02:00
has lex unit: star.n
has frame element: Type.performers and roles
has frame element: Performer1.performers and roles
has frame element: Medium.performers and roles
frame c by: MJE
definition: A Performer has a certain Role in a Performance and plays their part by following the directions in the Script for that particular Role. Margaret Thatcher played Juliet in a school play. "Pulp Fiction" starred John Travolta and a lot of other big names. Mel Gibson starred in "Braveheart" as the leader of a Scottish rebellion. I play the character of Yusuf in this film.
has lex unit: act.v
has frame element: Duration.performers and roles
has frame element: Role.performers and roles
has lex unit: feature.v
has lex unit: part.n
has frame relation: Performing arts
has lex unit: co-star (in).v
definition: <def-root>A <fen>Performer</fen> has a certain <fen>Role</fen> in a <fen>Performance</fen> and plays their part by following the directions in the <fen>Script</fen> for that particular <fen>Role</fen>. <ex><fex name="Performer">Margaret Thatcher</fex> <t>played</t> <fex name="Role">Juliet</fex> <fex name="Performance">in a school play</fex>.</ex> <ex><fex name="Performance">"Pulp Fiction"</fex> <t>starred</t> <fex name="Performer">John Travolta and a lot of other big names</fex>.</ex> <ex><fex name="Performer">Mel Gibson</fex> <t>starred</t> <fex name="Performance">in "Braveheart"</fex> <fex name="Role">as the leader of a Scottish rebellion</fex>.</ex> <ex>I play the <t>character</t> <fex name="Role">of Yusuf</fex> in this film.</ex></def-root>
has lex unit: star.v
has lex unit: role.n
has frame element: Audience.performers and roles
has sem type: Non-perspectivalized frame
frame ID: 413
has lex unit: appear.v
frame name: Performers_and_roles
has frame relation: Performers
has lex unit: co-star.n
has lex unit: character.n
type: Class
has frame element: Script.performers and roles
has frame element: Manner.performers and roles
comment: A Performer has a certain Role in a Performance and plays their part by following the directions in the Script for that particular Role. Margaret Thatcher played Juliet in a school play. "Pulp Fiction" starred John Travolta and a lot of other big names. Mel Gibson starred in "Braveheart" as the leader of a Scottish rebellion. I play the character of Yusuf in this film.
has lex unit: as.prep
has frame element: Performer.performers and roles
subclass of: Restriction
  on property: hasComponent
  some values from: Performers
has lex unit: play.v
has frame element: Performance.performers and roles
uses: Performing arts