People_by_vocation
type: Frame
type: Class
comment: This frame contains words for Individuals as viewed in terms of their vocation. The Person is conceived of as independent of other specific individuals with whom they have relationships and independent of their participation in any particular activity. They may have a Descriptor, Origin, Persistent_characteristic, or Ethnicity. A specific Age may sometimes be specified as well. Humphrey Bogart was a great actor.
subclass of: People
subclass of: Restriction
  on property: hasComponent
  some values from: Medical professionals
inherits from: People
narrower match: synset-professional-adjective-1
frame sectivity: sub
definition: This frame contains words for Individuals as viewed in terms of their vocation. The Person is conceived of as independent of other specific individuals with whom they have relationships and independent of their participation in any particular activity. They may have a Descriptor, Origin, Persistent_characteristic, or Ethnicity. A specific Age may sometimes be specified as well.
definition: This frame contains words for Individuals as viewed in terms of their vocation. The Person is conceived of as independent of other specific individuals with whom they have relationships and independent of their participation in any particular activity. They may have a Descriptor, Origin, Persistent_characteristic, or Ethnicity. A specific Age may sometimes be specified as well. Humphrey Bogart was a great actor.
definition: <def-root>This frame contains words for Individuals as viewed in terms of their vocation. The <fen>Person</fen> is conceived of as independent of other specific individuals with whom they have relationships and independent of their participation in any particular activity. They may have a <fen>Descriptor</fen>, <fen>Origin</fen>, <fen>Persistent_characteristic</fen>, or <fen>Ethnicity</fen>. A specific <fen>Age</fen> may sometimes be specified as well.</def-root>
frame ID: 1071
frame c by: JKR
frame c date: 2004-04-08T15:12:56+02:00
frame name: People_by_vocation
has frame element: Rank.people by vocation
has frame element: Age.people by vocation
has frame element: Origin.people by vocation
has frame element: Employer.people by vocation
has frame element: Person.people by vocation
has frame element: Contract basis.people by vocation
has frame element: Descriptor.people by vocation
has frame element: Type.people by vocation
has frame element: Place of employment.people by vocation
has frame element: Compensation.people by vocation
has frame element: Ethnicity.people by vocation
has frame element: Context of acquaintance.people by vocation
has frame element: Persistent characteristic.people by vocation
has frame relation: Medical professionals
has frame relation: People
has frame relation: Member of military
has frame relation: Representative
has frame relation: Performers
has lex unit: linguist.n
has lex unit: salesman.n
has lex unit: designer.n
has lex unit: senator.n
has lex unit: anthropologist.n
has lex unit: businessman.n
has lex unit: receptionist.n
has lex unit: toxicologist.n
has lex unit: manservant.n
has lex unit: clerk.n
has lex unit: student.n
has lex unit: web developer.n
has lex unit: gardener.n
has lex unit: programmer.n
has lex unit: waiter.n
has lex unit: servant.n
has lex unit: archaeologist.n
has lex unit: homemaker.n
has lex unit: technician.n
has lex unit: politician.n
has lex unit: spokesperson.n
has lex unit: spy.n
has lex unit: engineer.n
has lex unit: private eye.n
has lex unit: maid.n
has lex unit: director.n
has lex unit: tailor.n
has lex unit: singer.n
has lex unit: police officer.n
has lex unit: cook.n
has lex unit: double agent.n
has lex unit: firefighter.n
has lex unit: attorney.n
has lex unit: agent.n
has lex unit: psychologist.n
has lex unit: physicist.n
has lex unit: mathematician.n
has lex unit: architect.n
has lex unit: sociologist.n
has lex unit: soldier.n
has lex unit: scholar.n
has lex unit: attendant.n
has lex unit: police.n
has lex unit: professor.n
has lex unit: actress.n
has lex unit: biologist.n
has lex unit: researcher.n