People_by_age
has lex unit: newborn.n
frame ID: 973
has lex unit: adult.n
has lex unit: baby.n
has frame element: Context of acquaintance.people by age
has lex unit: adolescent.n
has lex unit: spring chicken.n
definition: <def-root>This frame contains words for individuals as viewed in terms of their age. The <fen>Person</fen> is conceived of as independent of other specific individuals with whom they have relationships and independent of their participation in any particular activity. They may have a <fen>Descriptor</fen>, <fen>Origin</fen>, <fen>Persistent_characteristic</fen>, or <fen>Ethnicity</fen>. A specific <fen>Age</fen> may sometimes be specified as well.</def-root>
has frame element: Persistent characteristic.people by age
comment: This frame contains words for individuals as viewed in terms of their age. The Person is conceived of as independent of other specific individuals with whom they have relationships and independent of their participation in any particular activity. They may have a Descriptor, Origin, Persistent_characteristic, or Ethnicity. A specific Age may sometimes be specified as well. He is a 12-year-old kid.
has lex unit: coot.n
has frame relation: People
has lex unit: youngster.n
has lex unit: boy.n
frame c date: 2004-02-20T14:26:18+01:00
has lex unit: geezer.n
definition: This frame contains words for individuals as viewed in terms of their age. The Person is conceived of as independent of other specific individuals with whom they have relationships and independent of their participation in any particular activity. They may have a Descriptor, Origin, Persistent_characteristic, or Ethnicity. A specific Age may sometimes be specified as well.
has frame relation: Age
definition: This frame contains words for individuals as viewed in terms of their age. The Person is conceived of as independent of other specific individuals with whom they have relationships and independent of their participation in any particular activity. They may have a Descriptor, Origin, Persistent_characteristic, or Ethnicity. A specific Age may sometimes be specified as well. He is a 12-year-old kid.
has frame element: Origin.people by age
type: Class
inherits from: People
has frame element: Person.people by age
has lex unit: youth.n
has frame element: Descriptor.people by age
has lex unit: teenager.n
has frame element: Ethnicity.people by age
has lex unit: infant.n
type: Frame
has frame element: Age.people by age
has lex unit: neonate.n
frame name: People_by_age
subclass of: People
uses: Age
has lex unit: elderly.n
has lex unit: kid.n
has lex unit: child.n
frame c by: JKR