Part_inner_outer
has lex unit: inside.a
type: Transparent Noun
frame sectivity: sub
has frame element: Part prop.part inner outer
has lex unit: shell.n
narrower match: synset-outer-adjective-1
frame c by: ACW
subclass of: Part whole
definition: This frame concerns Parts of objects that are defined relative to the center or edge of the object. The Part is a part of the Whole and the Part_prop describes a property of the Part. She discarded the exterior of the walnut. She preferred a sparse church interior . In cases where the Target is an adjective, it has a special relationship with the noun that it modifies such that a phrase which is a syntactic argument of the noun is semantically available to fill the argument structure of the adjective, as in "the outside row of the class"The inner shelf of the bookcase was lying on the floor.
has lex unit: inside.n
has lex unit: exterior.adj
inherits from: Being included
has lex unit: central.a
has lex unit: outer.a
narrower match: synset-interior-adjective-1
narrower match: synset-exterior-adjective-1
has lex unit: interior.adj
has lex unit: interior.a
has lex unit: lining.n
has lex unit: central.adj
activates: PART WHOLE
has lex unit: outside.adj
frame other feature: rel
has lex unit: outer.adj
inherits from: Part piece
has lex unit: exterior.n
definition: <def-root>This frame concerns <fen>Part</fen>s of objects that are defined relative to the center or edge of the object. The <fen>Part</fen> is a part of the <fen>Whole</fen> and the <fen>Part_Prop</fen> describes a property of the <fen>Part</fen>. <ex>She discarded the <t><fex name="Part">exterior</fex></t> <fex name="Whole">of the walnut</fex></ex>. <ex> She preferred a sparse <fex name="Whole">church</fex> <t><fex name="Part">interior</fex></t> . </ex>. In cases where the <t>Target</t> is an adjective, it has a special relationship with the noun that it modifies such that a phrase which is a syntactic argument of the noun is semantically available to fill the argument structure of the adjective, as in "the <t>outside</t> <fex name="Part">row</fex> <fex name="Whole">of the class</fex>"<ex>The <t>inner</t> <fex name="Part">shelf</fex> <fex name="Whole">of the bookcase</fex> was lying on the floor.</ex> </def-root>
frame ID: 327
has lex unit: interior.n
has lex unit: outside.a
has lex unit: centre.n
has frame element: Whole.part inner outer
narrower match: synset-inside-adjectivesatellite-2
has lex unit: perimeter.n
has frame relation: Part whole
inherits from: Part whole
has lex unit: skin.n
has lex unit: inside.adj
has lex unit: inner.a
type: Frame
activates: CENTER PERIPHERY
has frame element: Part Prop.part inner outer
type: Class
frame c date: 2002-05-29T19:25:18+02:00
has lex unit: middle.n
comment: This frame concerns Parts of objects that are defined relative to the center or edge of the object. The Part is a part of the Whole and the Part_prop describes a property of the Part. She discarded the exterior of the walnut. She preferred a sparse church interior . In cases where the Target is an adjective, it has a special relationship with the noun that it modifies such that a phrase which is a syntactic argument of the noun is semantically available to fill the argument structure of the adjective, as in "the outside row of the class"The inner shelf of the bookcase was lying on the floor.
has lex unit: inner.adj
has sem type: Transparent Noun
narrower match: synset-outdoor-adjective-1
type: NamedIndividual
has lex unit: exterior.a
definition: This frame concerns Parts of objects that are defined relative to the center or edge of the object. The Part is a part of the Whole and the Part_Prop describes a property of the Part. She discarded the exterior of the walnut. She preferred a sparse church interior . . In cases where the Target is an adjective, it has a special relationship with the noun that it modifies such that a phrase which is a syntactic argument of the noun is semantically available to fill the argument structure of the adjective, as in "the outside row of the class"The inner shelf of the bookcase was lying on the floor.
narrower match: synset-inner-adjective-2
narrower match: synset-central-adjective-2
has lex unit: center.n
has lex unit: surface.n
has frame element: Part.part inner outer
has lex unit: outside.n
frame name: Part_inner_outer