Organization
has frame relation: Alliance
type: Frame
type: Class
subclass of: Aggregate
has frame element: Purpose.organization
has frame element: Container possessor.organization
has lex unit: organization.n
has lex unit: league.n
has lex unit: association.n
is inherited by: Military
has lex unit: union.n
has lex unit: cartel.n
has lex unit: delegation.n
frame ID: 1371
has frame element: Period of existence.organization
subclass of: Restriction
  on property: hasComponent
  some values from: Alliance
has lex unit: intelligence.n
has lex unit: government.n
is used by: Alliance
has frame element: Name.organization
has frame relation: Temporary group
has frame element: Organization.organization
has lex unit: brotherhood.n
is inherited by: Temporary group
has lex unit: parliament.n
definition: This frame describes intentionally formed human social groups (here termed Organizations) with some definite structure and Members. They may be relatively informal, consisting only of a group of individuals who are aware of who is and who is not a fellow member, or they may be complex and long-lasting, such as the Roman Catholic Church or the Conservative Party. Lucien is in the brotherhood.
subclass of: Restriction
  on property: hasComponent
  some values from: Institutions
has lex unit: group.n
has lex unit: agency.n
inherits from: Aggregate
has lex unit: club.n
has frame relation: Military
frame c by: CFB
has frame relation: Aggregate
has lex unit: society.n
frame c date: 2005-04-08T12:03:41+02:00
comment: This frame describes intentionally formed human social groups (here termed Organizations) with some definite structure and Members. They may be relatively informal, consisting only of a group of individuals who are aware of who is and who is not a fellow member, or they may be complex and long-lasting, such as the Roman Catholic Church or the Conservative Party. Lucien is in the brotherhood.
definition: <def-root>This frame describes intentionally formed human social groups (here termed <fen>Organization</fen>s) with some definite structure and <fen>Members</fen>. They may be relatively informal, consisting only of a group of individuals who are aware of who is and who is not a fellow member, or they may be complex and long-lasting, such as the Roman Catholic Church or the Conservative Party. </def-root>
has frame element: Members.organization
has lex unit: news outlet.n
subclass of: Restriction
  on property: hasComponent
  some values from: Military
is inherited by: Institutions
has frame element: Descriptor.organization
has lex unit: board.n
has frame relation: Institutions
has frame element: Place.organization
definition: This frame describes intentionally formed human social groups (here termed Organizations) with some definite structure and Members. They may be relatively informal, consisting only of a group of individuals who are aware of who is and who is not a fellow member, or they may be complex and long-lasting, such as the Roman Catholic Church or the Conservative Party.
frame name: Organization
has lex unit: order.n
has lex unit: committee.n