Opinion
has lex unit: hunch.n
has frame element: Cognizer.opinion
has frame element: Topic.opinion
has lex unit: subscriber.n
has lex unit: subscribe.v
has frame element: Constancy.opinion
has lex unit: sense.n
has lex unit: expect.v
has lex unit: feel.v
has frame relation: Awareness
subclass of: Restriction
  on property: hasComponent
  some values from: Be in agreement on assessment
type: Class
has lex unit: figure.v
has frame element: Time.opinion
comment: A Cognizer holds a particular Opinion, which may be portrayed as being about a particular Topic. John thinks that it looks better back . Well, my opinion about that is none of your business. What 's your take on the recent oil crisis ? Your view of Smithers as an excellent secretary is not shared by the rest of the UN.
subclass of: Restriction
  on property: hasComponent
  some values from: Taking sides
frame c date: 2005-04-26T19:54:54+02:00
is used by: Taking sides
has lex unit: believe.v
has lex unit: have feeling.v
has frame element: Domain.opinion
has frame element: Circumstances.opinion
definition: A Cognizer holds a particular Opinion, which may be portrayed as being about a particular Topic. John thinks that it looks better back . Well, my opinion about that is none of your business. What <ment>'s</ment> your take on the recent oil crisis ? Your view of Smithers as an excellent secretary is not shared by the rest of the UN.
definition: <def-root>A <fen>Cognizer</fen> holds a particular <fen>Opinion</fen>, which may be portrayed as being about a particular <fen>Topic</fen>. <ex><fex name="cog">John</fex> <t>thinks</t> <fex name="opi">that it looks better back</fex> .</ex> <ex>Well, <fex name="cog">my</fex> <fex name="opi"><t>opinion</t></fex> <fex name="top">about that</fex> is none of your business. </ex> <ex><fex name="opi">What</fex> <ment>'s</ment> <fex name="cog">your</fex> <t>take</t> <fex name="top">on the recent oil crisis</fex> ?</ex> <ex><fex name="cog">Your</fex> <t>view</t> <fex name="top">of Smithers</fex> <fex name="opi">as an excellent secretary</fex> is not shared by the rest of the UN.</ex></def-root>
see also: Awareness
has lex unit: view.n
has lex unit: believer.n
has lex unit: think.v
type: Frame
has lex unit: opinion.n
definition: A Cognizer holds a particular Opinion, which may be portrayed as being about a particular Topic. John thinks that it looks better back . Well, my opinion about that is none of your business. What 's your take on the recent oil crisis ? Your view of Smithers as an excellent secretary is not shared by the rest of the UN.
is used by: Be in agreement on assessment
has lex unit: take.n
frame name: Opinion
has frame element: Manner.opinion
frame c by: MJE
frame ID: 1412
has frame relation: Taking sides
has frame relation: Be in agreement on assessment
has lex unit: suppose.v
has frame element: Opinion.opinion
has lex unit: hold.v
has frame element: Evidence.opinion
has frame element: Role.opinion
has lex unit: belief.n