Observable body parts
has lex unit: breast.n
has lex unit: head.n
has lex unit: hindquarters.n
has lex unit: bill.n
subclass of: Shaped part
has lex unit: hair.n
has lex unit: talon.n
has lex unit: tooth.n
has lex unit: back.n
has lex unit: ankle.n
has lex unit: anus.n
has lex unit: fingernail.n
has lex unit: midriff.n
has lex unit: sole.n
has frame element: Body part.observable body parts
has lex unit: forefinger.n
has lex unit: foreleg.n
has lex unit: incisor.n
has lex unit: antler.n
has lex unit: tongue.n
inherits from: Shaped part
has lex unit: temple.n
has frame element: Descriptor.observable body parts
has lex unit: nostril.n
has lex unit: trunk.n
has lex unit: thigh.n
has frame element: Possessor.observable body parts
has lex unit: foot.n
has lex unit: chest.n
frame name: Observable_body_parts
has lex unit: beard.n
has lex unit: hand.n
has lex unit: brow.n
has lex unit: skin.n
has lex unit: toenail.n
has frame element: Subregion.observable body parts
has lex unit: elbow.n
has lex unit: knee.n
has lex unit: jaw.n
has frame element: Orientational Location.observable body parts
has lex unit: fin.n
has lex unit: thumb.n
has lex unit: hindleg.n
is used by: Manipulation
has lex unit: fang.n
has lex unit: thorax.n
has lex unit: face.n
has lex unit: forelimb.n
has lex unit: eyelid.n
has lex unit: cheek.n
has lex unit: buttocks.n
has lex unit: beak.n
has lex unit: member.n
has lex unit: body.n
has lex unit: pelt.n
has lex unit: mouth.n
has lex unit: tentacle.n
has lex unit: flesh.n
has lex unit: toe.n
has lex unit: snout.n
has lex unit: forearm.n
has lex unit: tail.n
has lex unit: fluke.n
is used by: Medical conditions
has lex unit: feeler.n
has lex unit: horn.n
definition: This frame covers words for Body_part(s) (BP) belonging to a Possessor (Poss), which may be characterized by a Descriptor (Desc). The location of the BP may be identified in terms of its Attachment or its Orientational_Location. A Subregion of a BP may also be indicated. The constructions in which body part words occur include the following:
has lex unit: forepaw.n
has lex unit: limb.n
has lex unit: forehead.n
is used by: Wearing
definition: <def-root>This frame covers words for <fen>Body_part</fen>(s) (BP) belonging to a <fen>Possessor</fen> (Poss), which may be characterized by a <fen>Descriptor</fen> (Desc). The location of the BP may be identified in terms of its <fen>Attachment</fen> or its <fen>Orientational_Location</fen>. A <fen>Subregion</fen> of a BP may also be indicated. The constructions in which body part words occur include the following:</def-root>
has lex unit: arm.n
has lex unit: chin.n
has lex unit: wing.n
inherits from: Being included
has lex unit: mustache.n
inherits from: Part whole
type: Class
has lex unit: fingertip.n