Natural_features
type: Frame
type: Class
comment: The Locale is a geographical location as defined by shape. This frame includes natural geographic features, including land/ice forms and bodies of water. We climbed up the rock cliff.
subclass of: Locale
subclass of: Restriction
  on property: hasComponent
  some values from: Relational natural features
inherits from: Locale
narrower match: synset-furrowed-adjective-1
narrower match: synset-coastal-adjective-2
narrower match: synset-continental-adjective-4
definition: The Locale is a geographical location as defined by shape. This frame includes natural geographic features, including land/ice forms and bodies of water. We climbed up the rock cliff.
frame ID: 191
frame c by: MJE
frame c date: 2001-07-31T14:50:15+02:00
frame name: Natural_features
has frame element: Locale.natural features
has frame element: Descriptor.natural features
has frame element: Formational cause.natural features
has frame element: Name.natural features
has frame element: Relative location.natural features
has frame element: Constituent parts.natural features
has frame element: Container possessor.natural features
has frame element: Type.natural features
has frame relation: Locale
has frame relation: Relational natural features
has lex unit: clough.n
has lex unit: cay.n
has lex unit: dune.n
has lex unit: reef.n
has lex unit: continental.adj
has lex unit: outcrop.n
has lex unit: height.n
has lex unit: land.n
has lex unit: brook.n
has lex unit: hill.n
has lex unit: headland.n
has lex unit: lagoon.n
has lex unit: rugged.adj
has lex unit: ridge.n
has lex unit: shoal.n
has lex unit: coombe.n
has lex unit: cirque.n
has lex unit: spring.n
has lex unit: mountain.n
has lex unit: sandbar.n
has lex unit: mount.n
has lex unit: sound.n
has lex unit: corrie.n
has lex unit: gap.n
has lex unit: cove.n
has lex unit: pond.n
has lex unit: wash.n
has lex unit: continent.n
has lex unit: eyot.n
has lex unit: lake.n
has lex unit: depression.n
has lex unit: river.n
has lex unit: sandspit.n
has lex unit: bay.n
has lex unit: loch.n
has lex unit: cordillera.n
has lex unit: cliff.n
has lex unit: gully.n
has lex unit: dale.n
has lex unit: sandbank.n
has lex unit: volcano.n
has lex unit: inlet.n
has lex unit: glen.n
has lex unit: bayou.n
has lex unit: pass.n
has lex unit: waterfall.n
has lex unit: hummock.n
has lex unit: sea.n
has lex unit: guyot.n
has lex unit: defile.n
has lex unit: dell.n
has lex unit: channel.n
has lex unit: berg.n
has lex unit: cavern.n
has lex unit: fjord.n
has lex unit: key.n