Medical_conditions
type: Class
type: Frame
inherits from: Gradable attributes
triggers: BadHealth
comment: Words in this frame name medical conditions or diseases that a patient suffers from, is being treated for, may be cured of, or die of. The condition or disease may be described in a variety of ways, including the part or area of the body (Body_Part) affected by the condition (e.g. liver cancer, cardiovascular disease), the Cause of the condition (e.g. bacterial meningitis, viral pneumonia), a prominent Symptom of the condition (e.g. asymptomatic stenosis, blue ear disease), the Patient or population (originally) affected by the condition (e.g. bovine tuberculosis, juvenile diabetes), or the (proper) Name used to identify the condition (e.g. Munchausen Syndrome, Lou Gehrig's Disease). Annotation in this frame is done in respect to the name of the condition or disease. John died of pancreatic cancer.
subclass of: Restriction
  on property: hasComponent
  some values from: Recovery
subclass of: Gradable attributes
narrower match: synset-paraplegic-adjectivesatellite-1
narrower match: synset-ailing-adjectivesatellite-1
narrower match: synset-ill-adjective-1
narrower match: synset-healthy-adjective-1
frame other feature: temp
frame sectivity: inter
definition: Words in this frame name medical conditions or diseases that a patient suffers from, is being treated for, may be cured of, or die of. The condition or disease may be described in a variety of ways, including the part or area of the body (Body_Part) affected by the condition (e.g. liver cancer, cardiovascular disease), the Cause of the condition (e.g. bacterial meningitis, viral pneumonia), a prominent Symptom of the condition (e.g. asymptomatic stenosis, blue ear disease), the Patient or population (originally) affected by the condition (e.g. bovine tuberculosis, juvenile diabetes), or the (proper) Name used to identify the condition (e.g. Munchausen Syndrome, Lou Gehrig's Disease). Annotation in this frame is done in respect to the name of the condition or disease. John died of pancreatic cancer.
definition: <def-root>Words in this frame name medical conditions or diseases that a patient suffers from, is being treated for, may be cured of, or die of. The condition or disease may be described in a variety of ways, including the part or area of the body (<fen>Body_Part</fen>) affected by the condition (e.g. liver cancer, cardiovascular disease), the <fen>Cause</fen> of the condition (e.g. bacterial meningitis, viral pneumonia), a prominent <fen>Symptom</fen> of the condition (e.g. asymptomatic stenosis, blue ear disease), the <fen>Patient</fen> or population (originally) affected by the condition (e.g. bovine tuberculosis, juvenile diabetes), or the (proper) <fen>Name</fen> used to identify the condition (e.g. Munchausen Syndrome, Lou Gehrig's Disease). Annotation in this frame is done in respect to the name of the condition or disease. <ex>John died of <fex name="Body_P">pancreatic</fex> <t>cancer</t>.</ex></def-root>
frame ID: 239
frame c by: MRLP
frame c date: 2001-10-28T13:10:24+01:00
frame name: Medical_conditions
has causative: Infecting
has frame element: Place.medical conditions
has frame element: Body Part.medical conditions
has frame element: Degree.medical conditions
has frame element: Name.medical conditions
has frame element: Body part.medical conditions
has frame element: Symptom.medical conditions
has frame element: Patient.medical conditions
has frame element: Duration.medical conditions
has frame element: Ailment.medical conditions
has frame element: Cause.medical conditions
has frame relation: Gradable attributes
has frame relation: Infecting
has frame relation: Recovery
has frame relation: Body parts
has frame relation: Cure
has frame relation: Condition symptom relation
has lex unit: wound.n
has lex unit: tumor.n
has lex unit: ill.a
has lex unit: cholera.n
has lex unit: syphilis.n
has lex unit: stress.n
has lex unit: diarrhea.n
has lex unit: cold.n
has lex unit: illness.n
has lex unit: ill.adj
has lex unit: paraplegic.a
has lex unit: hepatitis.n
has lex unit: arthritis.n
has lex unit: acromegaly.n
has lex unit: disorder.n
has lex unit: tuberculosis.n
has lex unit: colitis.n
has lex unit: hypertension.n
has lex unit: disease.n
has lex unit: strongylosis.n
has lex unit: schizophrenia.n
has lex unit: depression.n
has lex unit: asphyxia.n
has lex unit: develop.v
has lex unit: diphtheria.n
has lex unit: affliction.n
has lex unit: Alzheimer's.n
has lex unit: healthy.a
has lex unit: candida.n
has lex unit: cataract.n
has lex unit: stenosis.n
has lex unit: sickness.n
has lex unit: anorexia.n
has lex unit: infection.n
has lex unit: diabetes.n
has lex unit: influenza.n
has lex unit: cirrhosis.n
has lex unit: paraplegic.adj
has lex unit: cholecystitis.n
has lex unit: sick.adj
has lex unit: cryptosporidiosis.n
has lex unit: menorrhagia.n
has lex unit: dysmenorrhoea.n