Location_in_time
has frame element: Salient event.location in time
type: Frame
definition: The word(s) in this frame detail a particular moment in time.
definition: The word(s) in this frame detail a particular moment in time.These often occur with demonstratives such as this and that. Late that day, 1776, America declared sovereignty.
definition: <def-root>The word(s) in this frame detail a particular moment in time.</def-root>
frame c date: 2009-07-06T12:32:33+02:00
comment: The word(s) in this frame detail a particular moment in time.These often occur with demonstratives such as this and that. Late that day, 1776, America declared sovereignty.
has frame element: Focal time.location in time
frame c by: JKs
has frame element: Name.location in time
has frame element: Relative time.location in time
has lex unit: date.n
has lex unit: Day.n
has frame element: Descriptor.location in time
type: Class
has frame relation: Calendric unit
frame name: Location_in_time
has frame element: Measurement.location in time
subclass of: Restriction
  on property: hasComponent
  some values from: Calendric unit
frame ID: 2141
perspective on: Simultaneity
has frame element: Unit.location in time
has frame element: Whole.location in time
is inherited by: Calendric unit
has lex unit: time.n
has frame relation: Simultaneity