Locale_by_use
type: Class
type: Frame
inherits from: Locale
comment: Geography as defined by its use. You must land in the next airfield, as this one is currently having difficulties. The new sports complex was the tallest building on campus, oddly enough. Cities of the Northeast tend to be dingier.
subclass of: Restriction
  on property: hasComponent
  some values from: Prison
subclass of: Locale
narrower match: synset-rural-adjective-2
narrower match: synset-urban-adjective-1
frame sectivity: inter
definition: <def-root>Geography as defined by use. <ex>You must land in the next <t><fex name="Locale">airfield</fex></t>, as this one is currently having difficulties.</ex> <ex>The new <fex name="Use">sports</fex> <fex name="Locale"><t>complex</t></fex> was the tallest building on campus, oddly enough.</ex> <ex><t><fex name="Locale">Cities</fex></t> <fex name="Container_possessor">of the Northeast</fex> tend to be dingier.</ex></def-root>
definition: Geography as defined by its use. You must land in the next airfield, as this one is currently having difficulties. The new sports complex was the tallest building on campus, oddly enough. Cities of the Northeast tend to be dingier.
definition: Geography as defined by use. You must land in the next airfield, as this one is currently having difficulties. The new sports complex was the tallest building on campus, oddly enough. Cities of the Northeast tend to be dingier.
frame ID: 196
frame c by: MJE
frame c date: 2001-08-09T17:59:42+02:00
frame name: Locale_by_use
has frame element: Relative location.locale by use
has frame element: Formational cause.locale by use
has frame element: Name.locale by use
has frame element: Circumstances.locale by use
has frame element: Locale.locale by use
has frame element: Constituent parts.locale by use
has frame element: Use.locale by use
has frame element: Descriptor.locale by use
has frame element: Container possessor.locale by use
has frame relation: Locale
has frame relation: Roadways
has frame relation: Prison
has frame relation: Buildings
has lex unit: shop.n
has lex unit: laboratory.n
has lex unit: depot.n
has lex unit: port.n
has lex unit: airfield.n
has lex unit: courtyard.n
has lex unit: square.n
has lex unit: park((2)).n
has lex unit: factory.n
has lex unit: bathhouse.n
has lex unit: safe house.n
has lex unit: institute.n
has lex unit: park.n
has lex unit: village.n
has lex unit: settlement.n
has lex unit: facility.n
has lex unit: court.n
has lex unit: museum.n
has lex unit: restaurant.n
has lex unit: canal.n
has lex unit: firehouse.n
has lex unit: campus.n
has lex unit: headquarters.n
has lex unit: theater.n
has lex unit: pub.n
has lex unit: college.n
has lex unit: school.n
has lex unit: lab.n
has lex unit: cemetery.n
has lex unit: country.n
has lex unit: compound.n
has lex unit: boutique.n
has lex unit: center.n
has lex unit: urban.adj
has lex unit: parking lot.n
has lex unit: field.n
has lex unit: post office.n
has lex unit: development.n
has lex unit: ranch.n
has lex unit: mine.n
has lex unit: rural.adj
has lex unit: countryside.n
has lex unit: farm.n
has lex unit: complex.n
has lex unit: plant.n
has lex unit: garden.n
has lex unit: installation.n
has lex unit: silo.n
has lex unit: urban.a
has lex unit: base.n
has lex unit: work.n