Locale
is inherited by: Locale by characteristic entity
frame ID: 192
type: Class
frame c by: MJE
has frame relation: Bounded entity
is inherited by: Natural features
uses: Bounded entity
has frame element: Relative location.locale
has frame relation: Locale by ownership
is used by: Isolated places
definition: This frame contains general locale words, and is mostly a place-holder in the hierarchy. Words in this frame designate relatively stable bounded ares of the world which have permanent Relative_locations with respect to other locales, and thus are useful as permanent landmarks. It is inherited by Locale_by_use, which has to do with places that are named according to their intended use, or some habitual use, such as factory.n, dance floor.n, village.n, field.n. It is also inherited by Locale_by_event, which covers places that are names according to some event which took place there, such as concerts, battles, and meteor impacts. This is a pleasant area.
has frame relation: Building subparts
has frame element: Locale.locale
has frame relation: Locale by characteristic entity
subclass of: Restriction
  on property: hasComponent
  some values from: Natural features
frame c date: 2001-08-01T14:59:36+02:00
subclass of: Restriction
  on property: hasComponent
  some values from: Building subparts
has frame element: Descriptor.locale
has lex unit: point.n
frame name: Locale
is inherited by: Locale by ownership
has lex unit: area.n
subclass of: Restriction
  on property: hasComponent
  some values from: Locale by use
has lex unit: regional.a
has frame element: Name.locale
has frame element: Use.locale
comment: This frame contains general locale words, and is mostly a place-holder in the hierarchy. Words in this frame designate relatively stable bounded ares of the world which have permanent Relative_locations with respect to other locales, and thus are useful as permanent landmarks. It is inherited by Locale_by_use, which has to do with places that are named according to their intended use, or some habitual use, such as factory.n, dance floor.n, village.n, field.n. It is also inherited by Locale_by_event, which covers places that are names according to some event which took place there, such as concerts, battles, and meteor impacts. This is a pleasant area.
is inherited by: Relational location
is inherited by: Biological area
has lex unit: place.n
has frame element: Related event.locale
has frame element: Constituent parts.locale
has frame relation: Biological area
has lex unit: earth.n
definition: This frame contains general locale words, and is mostly a place-holder in the hierarchy. Words in this frame designate relatively stable bounded ares of the world which have permanent Relative_locations with respect to other locales, and thus are useful as permanent landmarks. It is inherited by Locale_by_use, which has to do with places that are named according to their intended use, or some habitual use, such as factory.n, dance floor.n, village.n, field.n. It is also inherited by Locale_by_event, which covers places that are names according to some event which took place there, such as concerts, battles, and meteor impacts.
subclass of: Restriction
  on property: hasComponent
  some values from: Isolated places
narrower match: synset-regional-adjective-1
is inherited by: Locale by event
has lex unit: site.n
has frame relation: Locale by use
subclass of: Restriction
  on property: hasComponent
  some values from: Biological area
is inherited by: Assigned location
has frame relation: Isolated places
has lex unit: region.n
has lex unit: zone.n
has lex unit: pocket.n
has frame relation: Assigned location
has frame element: Formational cause.locale
has lex unit: locale.n
has frame relation: Natural features
has lex unit: regional.adj
definition: <def-root>This frame contains general locale words, and is mostly a place-holder in the hierarchy. Words in this frame designate relatively stable bounded ares of the world which have permanent <fen>Relative_location</fen>s with respect to other locales, and thus are useful as permanent landmarks. It is inherited by Locale_by_use, which has to do with places that are named according to their intended use, or some habitual use, such as factory.n, dance floor.n, village.n, field.n. It is also inherited by Locale_by_event, which covers places that are names according to some event which took place there, such as concerts, battles, and meteor impacts.</def-root>
has frame relation: Relational location
has lex unit: spot.n
has lex unit: location.n
is inherited by: Locale by use
is used by: Building subparts
uses: Locative relation
has frame element: Inherent purpose.locale
has lex unit: grounds.n
subclass of: Restriction
  on property: hasComponent
  some values from: Locale by ownership
type: Frame
has frame element: Container possessor.locale
subclass of: Restriction
  on property: hasComponent
  some values from: Locale by event
frame sectivity: inter