Locale
type: Class
type: Frame
comment: This frame contains general locale words, and is mostly a place-holder in the hierarchy. Words in this frame designate relatively stable bounded ares of the world which have permanent Relative_locations with respect to other locales, and thus are useful as permanent landmarks. It is inherited by Locale_by_use, which has to do with places that are named according to their intended use, or some habitual use, such as factory.n, dance floor.n, village.n, field.n. It is also inherited by Locale_by_event, which covers places that are names according to some event which took place there, such as concerts, battles, and meteor impacts. This is a pleasant area.
subclass of: Restriction
  on property: hasComponent
  some values from: Natural features
subclass of: Restriction
  on property: hasComponent
  some values from: Isolated places
subclass of: Restriction
  on property: hasComponent
  some values from: Locale by use
subclass of: Restriction
  on property: hasComponent
  some values from: Locale by ownership
subclass of: Restriction
  on property: hasComponent
  some values from: Biological area
subclass of: Restriction
  on property: hasComponent
  some values from: Building subparts
subclass of: Restriction
  on property: hasComponent
  some values from: Locale by event
narrower match: synset-regional-adjective-1
frame sectivity: inter
definition: This frame contains general locale words, and is mostly a place-holder in the hierarchy. Words in this frame designate relatively stable bounded ares of the world which have permanent Relative_locations with respect to other locales, and thus are useful as permanent landmarks. It is inherited by Locale_by_use, which has to do with places that are named according to their intended use, or some habitual use, such as factory.n, dance floor.n, village.n, field.n. It is also inherited by Locale_by_event, which covers places that are names according to some event which took place there, such as concerts, battles, and meteor impacts. This is a pleasant area.
definition: This frame contains general locale words, and is mostly a place-holder in the hierarchy. Words in this frame designate relatively stable bounded ares of the world which have permanent Relative_locations with respect to other locales, and thus are useful as permanent landmarks. It is inherited by Locale_by_use, which has to do with places that are named according to their intended use, or some habitual use, such as factory.n, dance floor.n, village.n, field.n. It is also inherited by Locale_by_event, which covers places that are names according to some event which took place there, such as concerts, battles, and meteor impacts.
definition: <def-root>This frame contains general locale words, and is mostly a place-holder in the hierarchy. Words in this frame designate relatively stable bounded ares of the world which have permanent <fen>Relative_location</fen>s with respect to other locales, and thus are useful as permanent landmarks. It is inherited by Locale_by_use, which has to do with places that are named according to their intended use, or some habitual use, such as factory.n, dance floor.n, village.n, field.n. It is also inherited by Locale_by_event, which covers places that are names according to some event which took place there, such as concerts, battles, and meteor impacts.</def-root>
frame ID: 192
frame c by: MJE
frame c date: 2001-08-01T14:59:36+02:00
frame name: Locale
has frame element: Relative location.locale
has frame element: Locale.locale
has frame element: Descriptor.locale
has frame element: Name.locale
has frame element: Use.locale
has frame element: Related event.locale
has frame element: Constituent parts.locale
has frame element: Formational cause.locale
has frame element: Inherent purpose.locale
has frame element: Container possessor.locale
has frame relation: Bounded entity
has frame relation: Locale by ownership
has frame relation: Building subparts
has frame relation: Locale by characteristic entity
has frame relation: Biological area
has frame relation: Locale by use
has frame relation: Isolated places
has frame relation: Assigned location
has frame relation: Natural features
has frame relation: Relational location
has lex unit: point.n
has lex unit: area.n
has lex unit: regional.a
has lex unit: place.n
has lex unit: earth.n
has lex unit: site.n
has lex unit: region.n
has lex unit: zone.n
has lex unit: pocket.n
has lex unit: locale.n
has lex unit: regional.adj
has lex unit: spot.n
has lex unit: location.n
has lex unit: grounds.n
is inherited by: Locale by characteristic entity
is inherited by: Natural features
is inherited by: Locale by ownership
is inherited by: Relational location
is inherited by: Biological area
is inherited by: Locale by event
is inherited by: Assigned location
is inherited by: Locale by use
is used by: Isolated places
is used by: Building subparts
uses: Bounded entity
uses: Locative relation