Leadership
type: Frame
type: Class
comment: These are words referring to control by a Leader over a particular entity or group (the Governed) or an Activity. The frame contains both nouns referring to a title or position (e.g. director, king, president), and verbs describing the action of leadership (e.g. rule, reign). With verbs, it is possible to mention the Role played by the Leader (often a name of a leading position, e.g., king) Sebek em hat was a Leader of Priests. ca. 1780 BC In 1789 Fletcher Christian led the mutiny on HMS Bounty Louis XIV ruled over his people as king for the longest period of any European monarch. Compare to: Appellations.
subclass of: Restriction
  on property: hasComponent
  some values from: Political locales
triggers: Leadership
narrower match: synset-presidential-adjective-1
frame sectivity: inter
definition: <def-root>These are words referring to control by a <fen>Leader</fen> over a particular entity (the <fen>Governed</fen>) or an <fen>Activity</fen>. The frame contains both nouns referring to a title or position (e.g. <ment>director, king, president</ment>), and verbs describing the action of leadership (e.g. <ment>rule, reign</ment>). With verbs, it is possible to mention the <fen>Role</fen> played by the <fen>Leader</fen> (often a name of a leading position, e.g., <ment>king</ment>) <ex><fex name="lea">Sebek em hat</fex> <m>was</m> a <t>Leader</t> <fex name="gov">of Priests</fex>. ca. 1780 BC</ex> <ex><fex name="Time">In 1789</fex> <fex name="Leader">Fletcher Christian</fex> <t>led</t> <fex name="Activity">the mutiny on HMS Bounty</fex></ex> <ex><fex name="Leader">Louis XIV</fex> <t>ruled</t> <fex name="Governed">over his people</fex> <fex name="Role">as king</fex> <fex name="Duration">for the longest period of any European monarch</fex>.</ex></def-root>
definition: These are words referring to control by a Leader over a particular entity or group (the Governed) or an Activity. The frame contains both nouns referring to a title or position (e.g. director, king, president), and verbs describing the action of leadership (e.g. rule, reign). With verbs, it is possible to mention the Role played by the Leader (often a name of a leading position, e.g., king) Sebek em hat was a Leader of Priests. ca. 1780 BC In 1789 Fletcher Christian led the mutiny on HMS Bounty Louis XIV ruled over his people as king for the longest period of any European monarch. Compare to: Appellations.
definition: These are words referring to control by a Leader over a particular entity (the Governed) or an Activity. The frame contains both nouns referring to a title or position (e.g. <ment>director, king, president</ment>), and verbs describing the action of leadership (e.g. <ment>rule, reign</ment>). With verbs, it is possible to mention the Role played by the Leader (often a name of a leading position, e.g., <ment>king</ment>) Sebek em hat <m>was</m> a Leader of Priests. ca. 1780 BC In 1789 Fletcher Christian led the mutiny on HMS Bounty Louis XIV ruled over his people as king for the longest period of any European monarch.
frame ID: 73
frame c by: ChW
frame c date: 2001-02-07T13:12:24+01:00
frame name: Leadership
has causative: Change of leadership
has f ecore set: leadership coreSet1
has f ecore set: leadership coreSet2
has frame element: Time.leadership
has frame element: Governed.leadership
has frame element: Activity.leadership
has frame element: Duration.leadership
has frame element: Manner.leadership
has frame element: Role.leadership
has frame element: Depictive.leadership
has frame element: Descriptor.leadership
has frame element: Leader.leadership
has frame element: Degree.leadership
has frame element: Place.leadership
has frame element: Domain.leadership
has frame element: Type.leadership
has frame element: Means.leadership
has frame relation: Appellations
has frame relation: Political locales
has frame relation: Change of leadership
has lex unit: pasha.n
has lex unit: administration.n
has lex unit: legislature.n
has lex unit: command.n
has lex unit: governor.n
has lex unit: leader.n
has lex unit: principal.n
has lex unit: dictator.n
has lex unit: legislator.n
has lex unit: minister.n
has lex unit: prime minister.n
has lex unit: lawmaker.n
has lex unit: run.v
has lex unit: head.n
has lex unit: rule.n
has lex unit: boss.n
has lex unit: senate.n
has lex unit: khedive.n
has lex unit: monarch.n
has lex unit: reign.v
has lex unit: maharaja.n
has lex unit: despot.n
has lex unit: bishop.n
has lex unit: vice-captain.n
has lex unit: vice-principal.n
has lex unit: vice-president (political).n
has lex unit: presidential.adj
has lex unit: tsar.n
has lex unit: commissioner.n
has lex unit: chief executive officer.n
has lex unit: high-priest.n
has lex unit: major general.a
has lex unit: commander.n
has lex unit: vice-president (non-political).n
has lex unit: crown prince.n
has lex unit: chieftain.n
has lex unit: administer.v
has lex unit: command.v
has lex unit: kaiser.n
has lex unit: shah.n
has lex unit: rector.n
has lex unit: king.n
has lex unit: tsarina.n
has lex unit: satrap.n
has lex unit: diplomat.n
has lex unit: vizier.n