Judgment
is used by: Judgment communication
has lex unit: reprehensible.adj
has lex unit: damnation.n
has frame relation: Emotions
has lex unit: contempt.n
uses: Emotions
has lex unit: boo.v
type: Frame
has lex unit: blame.n
narrower match: synset-derisive-adjectivesatellite-1
has lex unit: exalt.v
has frame element: Result.judgment
has lex unit: applaud.v
has lex unit: uncritical.adj
has lex unit: reproach.n
has lex unit: scornful.adj
has lex unit: disapproving.a
has lex unit: stigmatize.v
is used by: Regard
has lex unit: reproachful.adj
has lex unit: critical.a
comment: A Cognizer makes a judgment about an Evaluee. The judgment may be positive (e.g. respect) or negative (e.g. condemn), and this information is recorded in the semantic types Positive and Negative on the Lexical Units of this frame. There may be a specific Reason for the Cognizer's judgment, or there may be a capacity or Role in which the Evaluee is judged. This frame is distinct from the Judgment_communication frame in that this frame does not involve the Cognizer communicating his or her judgment to an Addressee. JUDGMENT: She admired Einstein for his character. JUDGMENT_COMMUNICATION: She accused Einstein of collusion. Currently, however, some lexical units and annotation for both remain in this frame.
has lex unit: blame.v
frame c by: ChW
has frame relation: Exemplar
has lex unit: vilification.n
has lex unit: appreciative.a
has lex unit: fault.n
has lex unit: admiring.a
has lex unit: mockery.n
has lex unit: prize.v
has lex unit: disrespect.n
has frame relation: Judgment communication
has frame relation: Regard
has lex unit: contemptuous.adj
has lex unit: appreciative.adj
has lex unit: stricture.n
has lex unit: uncritical.a
has lex unit: scorn.n
has f ecore set: judgment coreSet1
has lex unit: fault.v
has frame element: Cognizer.judgment
has lex unit: set store.v
has lex unit: scornful.a
has lex unit: mock.v
has lex unit: scorn.v
has lex unit: admiring.adj
has lex unit: approving.a
narrower match: synset-appreciative-adjectivesatellite-1
is used by: Exemplar
has lex unit: appreciate.v
has lex unit: esteem.v
narrower match: synset-approving-adjectivesatellite-1
has lex unit: respect.n
has lex unit: reproachful.a
narrower match: synset-admonitory-adjectivesatellite-2
subclass of: FrameOccurrence
has lex unit: approving.adj
has frame element: Manner.judgment
type: ConceptualFrame
has lex unit: admire.v
has frame element: Role.judgment
has lex unit: respect.v
has frame relation: Praiseworthiness
has frame element: Degree.judgment
has lex unit: stigma.n
type: Class
definition: A Cognizer makes a judgment about an Evaluee. The judgment may be positive (e.g. respect) or negative (e.g. condemn), and this information is recorded in the semantic types Positive and Negative on the Lexical Units of this frame. There may be a specific Reason for the Cognizer's judgment, or there may be a capacity or Role in which the Evaluee is judged. This frame is distinct from the Judgment_communication frame in that this frame does not involve the Cognizer communicating his or her judgment to an Addressee. JUDGMENT: She admired Einstein for his character. JUDGMENT_COMMUNICATION: She accused Einstein of collusion. Currently, however, some lexical units and annotation for both remain in this frame.
has lex unit: critical.adj
narrower match: synset-disapproving-adjectivesatellite-1
has frame element: Reason.judgment
has lex unit: contemptuous.a
has lex unit: derisive.a
narrower match: synset-condemnable-adjectivesatellite-1
has frame element: Topic.judgment
has lex unit: exaltation.n
is used by: Praiseworthiness
has frame element: Expressor.judgment
narrower match: synset-uncritical-adjective-1
has lex unit: derisive.adj