Intoxicants
type: Class
type: Frame
comment: An Intoxicant is ingested in order to achieve an altered state of consciousness. A Type or Descriptor may be indicated as well. We smoked some high-grade marijuana. They smoked freebase cocaine.
subclass of: Restriction
  on property: hasComponent
  some values from: Intoxication
definition: An Intoxicant is ingested in order to achieve an altered state of consciousness. A Type or Descriptor may be indicated as well. We <gov>smoked</gov> <x>some high-grade marijuana</x>. They <gov>smoked</gov> <x>freebase cocaine</x>.
definition: <def-root>An <fen>Intoxicant</fen> is ingested in order to achieve an altered state of consciousness. A <fen>Type</fen> or <fen>Descriptor</fen> may be indicated as well. <ex> We <gov>smoked</gov> <x>some <fex name="Descriptor">high-grade</fex> <fex name="Intoxicant"><t>marijuana</t></fex></x>.</ex> <ex>They <gov>smoked</gov> <x><fex name="Type">freebase</fex> <fex name="Intoxicant"><t>cocaine</t></fex></x>.</ex></def-root>
definition: An Intoxicant is ingested in order to achieve an altered state of consciousness. A Type or Descriptor may be indicated as well. We smoked some high-grade marijuana. They smoked freebase cocaine.
frame ID: 390
frame c by: ACW
frame c date: 2002-08-05T12:15:59+02:00
frame name: Intoxicants
has frame element: Descriptor.intoxicants
has frame element: Country of origin.intoxicants
has frame element: Intoxicant.intoxicants
has frame element: Type.intoxicants
has frame relation: Intoxication
has frame relation: Physical entity
has lex unit: barbiturate.n
has lex unit: freebase.n
has lex unit: codeine.n
has lex unit: hashish.n
has lex unit: coke.n
has lex unit: opium.n
has lex unit: morphine.n
has lex unit: sedative.n
has lex unit: crack.n
has lex unit: mescaline.n
has lex unit: dope.n
has lex unit: marijuana.n
has lex unit: tranquillizer.n
has lex unit: grass.n
has lex unit: weed.n
has lex unit: heroin.n
has lex unit: pot.n
has lex unit: snuff.n
has lex unit: speed.n
has lex unit: tobacco.n
has lex unit: inhalant.n
has lex unit: downer.n
has lex unit: acid.n
has lex unit: ketamine.n
has lex unit: nicotine.n
has lex unit: cocaine.n
has lex unit: hallucinogen.n
has lex unit: peyote.n
has lex unit: alcohol.n
has lex unit: upper.n
has lex unit: cannabis.n
has lex unit: drug.n
has lex unit: amphetamine.n
has lex unit: ecstasy.n
has lex unit: LSD.n
has lex unit: lsd.n
has lex unit: cigarette.n
has lex unit: methamphetamine.n
inherits from: Physical entity
is used by: Intoxication