Intentionally_create
subclass of: Restriction
  on property: hasComponent
  some values from: Achieving first
has frame element: Creator.intentionally create
has frame relation: Manufacturing
inherits from: Objective influence
has lex unit: development.n
type: Frame
frame c date: 2002-03-04T11:58:06+01:00
is inherited by: Manufacturing
is inherited by: Building
has frame element: Time.intentionally create
has frame element: Means.intentionally create
subclass of: Restriction
  on property: hasComponent
  some values from: Text creation
has frame relation: Achieving first
has lex unit: synthesis.n
subclass of: Restriction
  on property: hasComponent
  some values from: Manufacturing
has lex unit: establishment.n
subclass of: Intentionally act
type: Class
has frame relation: Intentionally act
has frame relation: Duplication
subclass of: Restriction
  on property: hasComponent
  some values from: Translating
has lex unit: establish.v
has frame relation: Knot creation
has lex unit: found.v
has frame element: Place.intentionally create
definition: The Creator creates a new entity, the Created_entity, possibly out of Components.
has frame relation: Building
definition: <def-root>The <fen>Creator</fen> creates a new entity, the <fen>Created_entity</fen>, possibly out of <fen>Components</fen>.</def-root>
subclass of: Restriction
  on property: hasComponent
  some values from: Cooking creation
inherits from: Event
has frame element: Components.intentionally create
inherits from: Intentionally act
subclass of: Restriction
  on property: hasComponent
  some values from: Knot creation
has lex unit: creation.n
is inherited by: Knot creation
inherits from: Creating
subclass of: Restriction
  on property: hasComponent
  some values from: Duplication
frame c by: MJE
has lex unit: synthesise.v
comment: The Creator creates a new entity, the Created_entity, possibly out of Components. The Libyans were generating arms for export.
has frame element: Created entity.intentionally create
has frame element: Manner.intentionally create
inherits from: Transitive action
frame ID: 280
has frame element: Purpose.intentionally create
is inherited by: Text creation
has lex unit: generate.v
is inherited by: Create physical artwork
has frame relation: Text creation
has lex unit: set up.v
is inherited by: Duplication
has frame relation: Cooking creation
subclass of: Creating
has lex unit: production.n
is inherited by: Achieving first
is inherited by: Cooking creation
has frame relation: Creating
has lex unit: produce.v
frame name: Intentionally_create
subclass of: Restriction
  on property: hasComponent
  some values from: Creating
has frame element: Depictive.intentionally create
has lex unit: generation.n
has frame element: Co-participant.intentionally create
has frame relation: Translating
has lex unit: develop.v
has frame relation: Create physical artwork
has frame element: Role.intentionally create
has frame element: Co participant.intentionally create
has lex unit: create.v
subclass of: Restriction
  on property: hasComponent
  some values from: Building
definition: The Creator creates a new entity, the Created_entity, possibly out of Components. The Libyans were generating arms for export.
has frame element: Instrument.intentionally create
is inherited by: Translating
subclass of: Restriction
  on property: hasComponent
  some values from: Create physical artwork
has lex unit: make.v