Impact
has frame relation: Make noise
type: NamedIndividual
subframe of: Cause impact
type: Frame
has frame element: Impactors.impact
has lex unit: plough.v
has lex unit: rap.v
has lex unit: patter.v
has frame element: Depictive.impact
has frame element: Place.impact
has frame element: Subregion.impact
has lex unit: clang.v
has lex unit: hiss.v
see also: Make noise
has lex unit: clunk.v
has lex unit: hit.v
has lex unit: slam.v
has lex unit: thud.v
has lex unit: bang.v
has lex unit: click.v
has frame relation: Cause impact
has lex unit: crash.v
has lex unit: thump.v
has lex unit: clash.v
has frame element: Manner.impact
has frame element: Force.impact
has lex unit: slap.v
has frame element: Cause.impact
has lex unit: plash.v
has lex unit: plunk.v
has lex unit: glancing.adj
has lex unit: rattle.v
definition: <def-root>While in motion, an <fen>Impactor</fen> makes sudden, forcible contact with the <fen>Impactee</fen>, or two <fen>Impactors</fen> both move, mutually making forcible contact. <ex><fex name="Impactor">The massive metal foot</fex> <t>hit</t> <fex name="Impactee">the ground</fex> <fex name="Result">with a huge thud</fex>.</ex> </def-root>
has lex unit: impact.v
has causative: Cause impact
has lex unit: plow.v
has frame element: Time.impact
has lex unit: strike.v
has lex unit: run.v
definition: While in motion, an Impactor makes sudden, forcible contact with the Impactee, or two Impactors both move, mutually making forcible contact. The massive metal foot hit the ground with a huge thud.
has lex unit: crash.n
has lex unit: smack.v
subclass of: Restriction
  on property: hasComponent
  some values from: Friction
has lex unit: touch.v
has lex unit: smash.v
has lex unit: plop.v
frame name: Impact
has lex unit: tinkle.v
has lex unit: collision.n
has lex unit: hit.n
has frame element: Impactee.impact
has frame element: Period of iterations.impact
has lex unit: graze.v
frame ID: 311
has lex unit: knock.v
has lex unit: clink.v
frame c by: MJE
has frame element: Explanation.impact
has lex unit: glancing.a
has lex unit: impact.n
has lex unit: clatter.v
frame c date: 2002-04-24T10:40:04+02:00
is used by: Friction
has lex unit: impinge.v
has frame element: Impactor.impact
comment: While in motion, an Impactor makes sudden, forcible contact with the Impactee, or two Impactors both move, mutually making forcible contact. The massive metal foot hit the ground with a huge thud.
has lex unit: collide.v
has frame element: Period of Iterations.impact
has lex unit: brush.v
has lex unit: bump.v
has lex unit: chatter.v
has frame element: Result.impact
type: Class
has lex unit: crunch.v
activates: BLOCKAGE
has frame element: Speed.impact
has frame relation: Friction