Getting
has lex unit: procurement ((act)).n
is inchoative of: Possession
has frame element: Purpose.getting
subclass of: Event
is preceded by: Pre getting
has frame relation: Post getting
has frame relation: Taking
has causative: Giving
subclass of: Restriction
  on property: follows
  some values from: Pre getting
has lex unit: secure.v
has frame element: Source.getting
has frame element: Beneficiary.getting
has frame element: Explanation.getting
comment: A Recipient starts off without the Theme in their possession, and then comes to possess it. Although the Source from which the Theme came is logically necessary, the Recipient and its changing relationship to the Theme is profiled. I got two whistles from John.
subclass of: Restriction
  on property: hasComponent
  some values from: Receiving
has frame element: Circumstances.getting
has frame relation: Receiving
has frame relation: Pre getting
frame ID: 179
type: Class
has frame relation: Amassing
has lex unit: win.v
has frame element: Concessive.getting
is inherited by: Commerce collect
subclass of: Restriction
  on property: hasComponent
  some values from: Kidnapping
has lex unit: acquisition ((act)).n
has lex unit: get.v
is inherited by: Receiving
is inherited by: Commerce buy
is inherited by: Taking
subframe of: Getting scenario
has frame element: Theme.getting
has lex unit: procurement.n
has frame element: Recipient.getting
has lex unit: obtain.v
has frame relation: Commerce collect
subclass of: Restriction
  on property: hasComponent
  some values from: Post getting
has frame element: Manner.getting
definition: A Recipient starts off without the Theme in their possession, and then comes to possess it. Although the Source from which the Theme came is logically necessary, the Recipient and its changing relationship to the Theme is profiled. I got two whistles from John.
subclass of: Restriction
  on property: hasComponent
  some values from: Taking
has lex unit: acquisition ((entity)).n
inherits from: Event
frame c date: 2001-07-16T12:22:06+02:00
type: Frame
has lex unit: gain.v
has frame relation: Commerce buy
has inchoative: Possession
has lex unit: acquire.v
has frame relation: Possession
frame c by: ACW
frame name: Getting
subclass of: Restriction
  on property: hasComponent
  some values from: Commerce collect
subclass of: Restriction
  on property: hasComponent
  some values from: Amassing
has frame element: Place.getting
has frame element: Time.getting
has frame relation: Getting scenario
is inherited by: Amassing
definition: <def-root>A <fen>Recipient</fen> starts off without the <fen>Theme</fen> in their possession, and then comes to possess it. Although the <fen>Source</fen> from which the <fen>Theme</fen> came is logically necessary, the <fen>Recipient</fen> and its changing relationship to the <fen>Theme</fen> is profiled. <ex><fex name="Recipient">I</fex> <t>got</t> <fex name="Theme">two whistles</fex> <fex name="Source">from John</fex>.</ex></def-root>
has lex unit: procure.v
has lex unit: score.v
precedes: Post getting
has lex unit: acquisition.n
has frame element: Result.getting
has frame relation: Event
is inherited by: Kidnapping
subclass of: Restriction
  on property: hasComponent
  some values from: Commerce buy
has frame element: Reason.getting
has frame element: Means.getting