Gathering_up
has frame element: Path.gathering up
inherits from: Intentionally affect
inherits from: Transitive action
has frame element: Instrument.gathering up
is causative of: Come together
frame name: Gathering_up
uses: Cause motion
type: Class
has frame relation: Intentionally affect
comment: This frame describes an Agent's gathering of Individuals (people or entities) into a group, the Aggregate, defined by relative proximity. The police gathered the suspects into a line-up. Compare this frame with Congregating, and contrast it with Amalgamating.
frame c date: 2002-01-22T21:29:56+01:00
has frame element: Co-participant.gathering up
has frame element: Source.gathering up
has frame element: Frequency.gathering up
has frame element: Agent.gathering up
inherits from: Intentionally act
has lex unit: together bring.v
has lex unit: collect.v
has frame relation: Come together
has frame element: Purpose.gathering up
inherits from: Event
has frame element: Individuals.gathering up
has frame relation: Cause motion
frame ID: 260
subclass of: Intentionally affect
has frame element: Aggregate.gathering up
has frame element: Means.gathering up
has frame element: Place.gathering up
has lex unit: bring together.v
frame c by: ACW
has lex unit: gather.v
has frame element: Goal.gathering up
subclass of: Restriction
  on property: hasComponent
  some values from: Come together
has f ecore set: gathering up coreSet1
has lex unit: herd.v
has lex unit: convene.v
has frame element: Time.gathering up
has frame element: Containing event.gathering up
has lex unit: amass.v
definition: This frame describes an Agent's gathering of Individuals (people or entities) into a group, the Aggregate, defined by relative proximity. The police gathered the suspects into a line-up. Compare this frame with Congregating, and contrast it with Amalgamating.
has frame element: Manner.gathering up
inherits from: Objective influence
has lex unit: assemble.v
has frame element: Co participant.gathering up
type: Frame
has lex unit: round up.v