First_rank
has lex unit: primary.adj
has lex unit: foremost.adj
has lex unit: chief.a
has lex unit: lead.a
has lex unit: leading.adj
narrower match: synset-first-adjectivesatellite-5
has frame element: Limits of consideration.first rank
type: Frame
has lex unit: principal.adj
has lex unit: leader.n
comment: An Item is located at the top end of a scale of importance or social rank (or some other Attribute) in comparison to other members of a Contrast_set (usually, implicit) that is otherwise similar in kind to the Item. Oftentimes, the limits of the Contrast_set are determined by an expression of the Limits_of_consideration. The main problem is that the administration has not yet clarified "Regime change." INI Oh, he had a great many concerns -- chief among them his own boredom. Their primary objective in Bosnia was bringing about a lasting peace. INI
definition: <def-root>An <fen>Item</fen> is located at the top end of a scale of importance or social rank (or some other <fen>Attribute</fen>) in comparison to other members of a <fen>Contrast_set</fen> (usually, implicit) that is otherwise similar in kind to the <fen>Item</fen>. Oftentimes, the limits of the <fen>Contrast_set</fen> are determined by an expression of the <fen>Limits_of_consideration</fen>. <ex>The <t>main</t> <fex name="Item">problem</fex> is that the administration has not yet clarified "Regime change." <fex name="Contrast_set">INI</fex></ex> <ex>Oh, he had a great many concerns -- <t>chief</t> <fex name="Contrast_set">among them</fex> <fex name="Item">his own boredom</fex>.</ex> <ex>Their <t>primary</t> <fex name="Item">objective</fex> <fex name="Limits_of_consideration">in Bosnia</fex> was bringing about a lasting peace. <fex name="Contrast_set">INI</fex></ex></def-root>
type: Class
has lex unit: main.adj
frame sectivity: sub
uses: Prominence
has frame element: Item.first rank
frame c by: MJE
definition: An Item is located at the top end of a scale of importance or social rank (or some other Attribute) in comparison to other members of a Contrast_set (usually, implicit) that is otherwise similar in kind to the Item. Oftentimes, the limits of the Contrast_set are determined by an expression of the Limits_of_consideration. The main problem is that the administration has not yet clarified "Regime change." INI Oh, he had a great many concerns -- chief among them his own boredom. Their primary objective in Bosnia was bringing about a lasting peace. INI
uses: Gradable attributes
frame c date: 2002-09-23T11:21:59+02:00
has lex unit: lead.adj
has frame relation: Dominate situation
has lex unit: foremost.a
is used by: Dominate situation
subclass of: Restriction
  on property: hasComponent
  some values from: Dominate situation
has lex unit: lead.n
has lex unit: main.a
has lex unit: principal.a
narrower match: synset-leading-adjectivesatellite-1
frame name: First_rank
has lex unit: chief.adj
has lex unit: primary.a
has frame relation: Prominence
has frame element: Contrast set.first rank
has frame element: Attribute.first rank
has lex unit: leading.a
frame other feature: scalar
frame ID: 402
has frame relation: Gradable attributes
narrower match: synset-chief-adjectivesatellite-1