Fields
type: Frame
type: Class
comment: An individual or group (Practitioner) or a part of their work life (Work) is defined professionally by the Activity that they typically engage in. Alternatively, the Activity may be indicated by a Salient_entity conventionally associated with it. Chris was in the construction industry for 20 years before coming to GSCM. My career was in oil and gas.
subclass of: Restriction
  on property: hasComponent
  some values from: Craft
narrower match: synset-artistic-adjective-1
narrower match: synset-industrial-adjective-1
narrower match: synset-literary-adjectivesatellite-3
frame sectivity: inter
definition: An individual or group (Practitioner) or a part of their work life (Work) is defined professionally by the Activity that they typically engage in. Alternatively, the Activity may be indicated by a Salient_entity conventionally associated with it. Chris was in the construction industry for 20 years before coming to GSCM. My career was in oil and gas.
definition: <def-root>An individual or group (<fen>Practitioner</fen>) or a part of their work life (<fen>Work</fen>) is defined professionally by the <fen>Activity</fen> that they typically engage in. Alternatively, the <fen>Activity</fen> may be indicated by a <fen>Salient_entity</fen> conventionally associated with it. <ex> <fex name="pra">Chris</fex> was <m>in</m> the <fex name="act">construction</fex> <t>industry</t> for 20 years before coming to GSCM.</ex> <ex><fex name="wor">My career</fex> <m>was</m> <t>in</t> <fex name="sal">oil and gas</fex>.</ex></def-root>
definition: An individual or group (Practitioner) or a part of their work life (Work) is defined professionally by the Activity that they typically engage in. Alternatively, the Activity may be indicated by a Salient_entity conventionally associated with it. Chris was <m>in</m> the construction industry for 20 years before coming to GSCM. My career <m>was</m> in oil and gas.
frame ID: 1345
frame c by: JKR
frame c date: 2005-03-02T15:28:36+01:00
frame name: Fields
has f ecore set: fields coreSet1
has frame element: Time.fields
has frame element: Type.fields
has frame element: Practitioner.fields
has frame element: Work.fields
has frame element: Salient entity.fields
has frame element: Activity.fields
has frame element: Place.fields
has frame relation: People
has frame relation: Employment scenario
has frame relation: Craft
has lex unit: area.n
has lex unit: mathematics.n
has lex unit: theater.n
has lex unit: art.n
has lex unit: history.n
has lex unit: industry.n
has lex unit: artistic.adj
has lex unit: industrial.a
has lex unit: literature.n
has lex unit: technical.adj
has lex unit: finance.n
has lex unit: field.n
has lex unit: sector.n
has lex unit: literary.adj
has lex unit: literary.a
has lex unit: in.prep
has lex unit: math.n
has lex unit: industrial.adj
has lex unit: artistic.a
is used by: Craft
uses: People
uses: Employment scenario