Expertise
has lex unit: proficiency.n
has lex unit: so-so.adj
has lex unit: skilled.a
has lex unit: fantastic.adj
triggers: Experience
has lex unit: amateur.n
has lex unit: experienced.adj
has lex unit: terrible.a
has lex unit: so-so.a
has frame element: Role.expertise
has lex unit: maven.n
has lex unit: incompetence.n
has lex unit: awful.a
has lex unit: outstanding.a
has lex unit: wonderful.a
has lex unit: excellent.adj
narrower match: synset-colossal-adjectivesatellite-1
has lex unit: mediocre.a
has lex unit: master.adj
has lex unit: ineptness.n
has lex unit: experienced.a
has lex unit: pro.n
has lex unit: adeptness.n
has lex unit: good.a
has lex unit: superb.a
has lex unit: conversant.a
narrower match: synset-indifferent-adjectivesatellite-9
uses: Result of attempt scenario
has lex unit: skilful.a
inherits from: Gradable attributes
has lex unit: familiar.adj
has lex unit: lay.adj
has lex unit: splendid.a
narrower match: synset-competent-adjective-1
has lex unit: terrific.adj
has lex unit: ineptitude.n
has lex unit: inept.a
narrower match: synset-excellent-adjectivesatellite-1
has lex unit: expert.n
has lex unit: wonderful.adj
has lex unit: versed.a
has lex unit: familiar.a
narrower match: synset-adept-adjectivesatellite-1
has lex unit: proficient.adj
has lex unit: new (to).a
has lex unit: competent.adj
subclass of: Restriction
  on property: hasComponent
  some values from: Desirability
narrower match: synset-superb-adjectivesatellite-2
has lex unit: skilled.adj
has lex unit: tremendous.a
has lex unit: adept.adj
has lex unit: outstanding.adj
has lex unit: incredible.adj
has lex unit: incredible.a
has frame relation: Social behavior evaluation
has frame element: Behavior product.expertise
has lex unit: wizard.n
has lex unit: skill.n
has lex unit: whiz.n
has lex unit: dreadful.adj
has frame element: Knowledge.expertise
type: Class
has lex unit: awful.adj
has lex unit: fantastic.a
narrower match: synset-ace-adjectivesatellite-1
has lex unit: conversance.n
has frame element: Degree.expertise
narrower match: synset-skilled-adjective-1
definition: <def-root>This frame concerns people's knowledge or skill in certain domains. It does not concern acquaintance or familiarity with people. With adjectives as targets in this frame, we annotate on two FE layers. <ex>FE Layer-1: He is an <t>experienced</t> <fex name="Prot">programmer</fex>.</ex> <ex>FE Layer-2: He is an <t>experienced</t> <fex name="Skill">programmer</fex>.</ex></def-root>
has lex unit: inexperienced.adj
has lex unit: great.adj
has f ecore set: expertise coreSet2
has frame relation: Result of attempt scenario
has lex unit: excel.v
has frame element: Time.expertise
type: Frame
uses: Resolve attempt scenario
has lex unit: strong.adj
has lex unit: good.adj
has lex unit: superlative.a