Evidence
type: Class
type: Frame
comment: The Support, a phenomenon or fact, lends support to a claim or proposed course of action, the Proposition, where the Domain_of_relevance may also be expressed. Some of the words in this frame (e.g. argue) are communication words used in a non-communicative, epistemic sense. The latest poll results show that support of the president is at an all-time low.
subclass of: Restriction
  on property: hasComponent
  some values from: Explaining the facts
subclass of: Restriction
  on property: hasComponent
  some values from: Sign
definition: <def-root>The <fen>Support</fen>, a phenomenon or fact, lends support to a claim or proposed course of action, the <fen>Proposition</fen>, where the <fen>Domain_of_Relevance</fen> may also be expressed. Some of the words in this frame (e.g. argue) are communication words used in a non-communicative, epistemic sense. <ex><fex name="Support">The latest poll results</fex> <t>show</t> <fex name="Proposition">that support of the president is at an all-time low.</fex></ex> </def-root>
definition: The Support, a phenomenon or fact, lends support to a claim or proposed course of action, the Proposition, where the Domain_of_Relevance may also be expressed. Some of the words in this frame (e.g. argue) are communication words used in a non-communicative, epistemic sense. The latest poll results show that support of the president is at an all-time low.
definition: The Support, a phenomenon or fact, lends support to a claim or proposed course of action, the Proposition, where the Domain_of_relevance may also be expressed. Some of the words in this frame (e.g. argue) are communication words used in a non-communicative, epistemic sense. The latest poll results show that support of the president is at an all-time low.
frame ID: 25
frame c by: ChW
frame c date: 2001-02-07T13:11:55+01:00
frame name: Evidence
has frame element: Cognizer.evidence
has frame element: Domain of relevance.evidence
has frame element: Support.evidence
has frame element: Proposition.evidence
has frame element: Depictive.evidence
has frame element: Manner.evidence
has frame element: Degree.evidence
has frame element: Domain of Relevance.evidence
has frame element: Result.evidence
has frame element: Means.evidence
has frame relation: Sign
has frame relation: Explaining the facts
has lex unit: suggest.v
has lex unit: demonstrate.v
has lex unit: support.v
has lex unit: demonstration.n
has lex unit: contradict.v
has lex unit: argument.n
has lex unit: attest.v
has lex unit: prove.v
has lex unit: illustrate.v
has lex unit: evidence.n
has lex unit: credence ((lend)).n
has lex unit: indicate.v
has lex unit: show.v
has lex unit: credence.n
has lex unit: reveal.v
has lex unit: disprove.v
has lex unit: from.prep
has lex unit: assure.v
has lex unit: mean.v
has lex unit: verify.v
has lex unit: proof.n
has lex unit: evince.v
has lex unit: rule out.v
has lex unit: confirm.v
has lex unit: substantiate.v
has lex unit: point to.v
has lex unit: argue.v
has lex unit: imply.v
has lex unit: evidence.v
has lex unit: corroborate.v
has lex unit: testify.v
has lex unit: tell.v
is used by: Sign
is used by: Explaining the facts