Event
type: Frame
type: Class
comment: An Event takes place at a Place and Time. Big earthquakes only happen along plate boundaries. INI The party will take place on Sunday in the all-you-can-eat buffet.
subclass of: Restriction
  on property: hasComponent
  some values from: Intentionally act
definition: <def-root>An <fen>Event</fen> takes place at a <fen>Place</fen> and <fen>Time</fen>. <ex><fex name="Event">Big earthquakes</fex> only <t>happen</t> <fex name="Place">along plate boundaries</fex>. <fex name="Time">INI</fex> </ex> <ex><fex name="Event">The party</fex> will <t>take place</t> <fex name="Time">on Sunday</fex> <fex name="Place">in the all-you-can-eat buffet</fex>.</ex></def-root>
definition: An Event takes place at a Place and Time. Big earthquakes only happen along plate boundaries. INI The party will take place on Sunday in the all-you-can-eat buffet.
frame ID: 187
frame c by: MJE
frame c date: 2001-07-16T16:41:00+02:00
frame name: Event
has frame element: Place.event
has frame element: Event.event
has frame element: Time.event
has frame element: Reason.event
has frame element: Timespan.event
has frame element: Duration.event
has frame element: Explanation.event
has frame element: Manner.event
has frame element: Frequency.event
has frame relation: Motion
has frame relation: Event initial state
has frame relation: Emergency
has frame relation: Losing someone
has frame relation: Coming to be
has frame relation: Process pause
has frame relation: Event endstate
has frame relation: Process stop
has frame relation: Participation
has frame relation: Traversing
has frame relation: Undergoing
has frame relation: Rotting
has frame relation: Getting
has frame relation: Misdeed
has frame relation: Manner
has frame relation: Eventive affecting
has frame relation: Dynamic situation scenario
has frame relation: Objective influence
has frame relation: Hindering
has frame relation: Experience bodily harm
has frame relation: Transition to state
has frame relation: Process start
has frame relation: Go into shape
has frame relation: Intentionally act
has frame relation: Waking up
has frame relation: Process end
has frame relation: Frequency
has frame relation: Coincidence
has frame relation: Change of consistency
has frame relation: Come together
has frame relation: Birth scenario
has frame relation: Preventing or letting
has frame relation: Temporal pattern
has frame relation: Process resume
has frame relation: Change position on a scale
has frame relation: Locale by event
has frame relation: Coming to believe
has lex unit: development.n
has lex unit: episode.n
has lex unit: occur.v
has lex unit: event.n
has lex unit: go on.v
has lex unit: transpire.v
has lex unit: take place.v
has lex unit: happen.v
has lex unit: incident.n
is inherited by: Objective influence
is inherited by: Birth
is inherited by: Process end
is inherited by: Transitive action
is inherited by: Experience bodily harm
is inherited by: Go into shape
is inherited by: Traversing
is inherited by: Coming to believe
is inherited by: Coming to be
is inherited by: Getting
is inherited by: Come together
is inherited by: Change of consistency
is inherited by: Misdeed
is inherited by: Ceasing to be