Event
is inherited by: Objective influence
has lex unit: development.n
subclass of: Restriction
  on property: hasComponent
  some values from: Becoming
is inherited by: Birth
has frame relation: Motion
is inherited by: Process end
has lex unit: episode.n
has frame element: Place.event
has frame relation: Event initial state
has frame relation: Emergency
is inherited by: Transitive action
has lex unit: occur.v
is inherited by: Experience bodily harm
has frame relation: Losing someone
is inherited by: Go into shape
has frame relation: Coming to be
is inherited by: Traversing
is inherited by: Coming to believe
is used by: Preventing or letting
has frame relation: Process pause
has frame relation: Event endstate
precedes: Event endstate
has frame relation: Process stop
is inherited by: Coming to be
is preceded by: Event initial state
has frame relation: Participation
has frame relation: Traversing
frame ID: 187
has lex unit: event.n
is inherited by: Getting
is inherited by: Come together
is used by: Manner
is inherited by: Change of consistency
has lex unit: go on.v
has frame relation: Undergoing
has frame relation: Rotting
subframe of: Dynamic situation scenario
is inherited by: Misdeed
has frame relation: Getting
is inherited by: Ceasing to be
is preceded by: Change of state initial state
is used by: Temporal pattern
is inherited by: Waking up
type: Frame
definition: <def-root>An <fen>Event</fen> takes place at a <fen>Place</fen> and <fen>Time</fen>. <ex><fex name="Event">Big earthquakes</fex> only <t>happen</t> <fex name="Place">along plate boundaries</fex>. <fex name="Time">INI</fex> </ex> <ex><fex name="Event">The party</fex> will <t>take place</t> <fex name="Time">on Sunday</fex> <fex name="Place">in the all-you-can-eat buffet</fex>.</ex></def-root>
has frame relation: Misdeed
is inherited by: Transition to state
is inherited by: Motion
has lex unit: transpire.v
has frame relation: Manner
frame c by: MJE
has frame relation: Eventive affecting
has frame relation: Dynamic situation scenario
has frame relation: Objective influence
subframe of: Change of state scenario
has frame relation: Hindering
has frame relation: Experience bodily harm
has frame element: Event.event
is used by: Preventing
has frame relation: Transition to state
has frame relation: Process start
is inherited by: Losing someone
has lex unit: take place.v
has frame element: Time.event
is inherited by: Process resume
is inherited by: Emergency
precedes: Change of state endstate
has frame relation: Go into shape
type: Class
is inherited by: Birth scenario
has frame relation: Intentionally act
is inherited by: Process pause
is used by: Hindering
is inherited by: Coincidence
has frame relation: Waking up
has frame element: Reason.event
is inherited by: Intentionally act
frame name: Event
has frame relation: Process end
has lex unit: happen.v