Employing
has frame element: Purpose.employing
frame name: Employing
has frame element: Employer.employing
has frame element: Employee.employing
has lex unit: employee.n
has lex unit: employment.n
frame c date: 2002-05-14T13:15:48+02:00
has frame element: Place.employing
has frame relation: Employer scenario
is preceded by: Hiring
type: Frame
has frame element: Contract basis.employing
type: Class
has frame element: Descriptor.employing
definition: <def-root>An <fen>Employer</fen> employs an <fen>Employee</fen> whose <fen>Position</fen> entails that the <fen>Employee</fen> perform certain <fen>Task</fen>s in exchange for <fen>Compensation</fen>. <ex><fex name="Emper">I</fex> <t>employed</t> <fex name="Empee">him</fex> <fex name="Posit">as Chief Gardener</fex> <fex name="Dur">for ten years</fex>.</ex></def-root>
subframe of: Employer scenario
has frame element: Duration.employing
has frame element: Time.employing
has frame element: Manner.employing
has frame element: Position.employing
has lex unit: worker.n
definition: An Employer employs an Employee whose Position entails that the Employee perform certain Tasks in exchange for Compensation. I employed him as Chief Gardener for ten years.
perspective on: Employment continue
comment: An Employer employs an Employee whose Position entails that the Employee perform certain Tasks in exchange for Compensation. I employed him as Chief Gardener for ten years.
frame ID: 323
subframe of: Employers scenario
has frame element: Compensation.employing
has lex unit: personnel.n
has frame element: Subgroup.employing
precedes: Firing
subclass of: Restriction
  on property: follows
  some values from: Hiring
has frame relation: Firing
has frame relation: Hiring
subclass of: Restriction
  on property: hasComponent
  some values from: Firing
has lex unit: staff.n
frame c by: MJE
has frame element: Field.employing
has frame relation: Employment continue
has lex unit: employer.n
has frame element: Task.employing
has lex unit: employ.v
has f ecore set: employing coreSet1
has lex unit: commission.v