Education_teaching
has frame relation: Intentionally affect
comment: This frame contains words referring to teaching and the participants in teaching. A Student comes to learn either about a Subject; a Skill; a Precept; or a Fact as a result of instruction by a Teacher. Some of the nouns (schoolmaster, -mistress) in this frame refer to administrative positions and do not take relevant frame elements; these will be moved. Dad taught me that if you work hard, you will be OK - no matter what happens. What Our Cat taught Me About Marketing! For two years she taught me French Mom and Dad taught me not to bullshit, because it always came back to bite me in the ass, without fail. A young swiss girl up in a swiss chalet taught me how to yodel. Young Murdock later met a blind martial arts master known as Stick, who taught him how to use his augmented senses and trained him as a fighter. Maria, a woman studying to be a nun is sent from her convent to be the governess of the seven children of a widowed naval captain Frame-Element relations: Several Frame element relations hold in this frame. There is a core-set {Material, Teacher} (possibly also including Institution); these FE's can fill the subject slot of the teach-type verbs. There is another core-set {Precept, Subject, Skill, Fact, Role} to do with what is learnt. In addition, the FE Qualification may occur with Subject and Role My sister is studying for a maths degree to be a teacher She's studying maths to be a teacher . Phrases expressing Qualification also very often include information about the Subject (see below), which is to be annotated on the second layer. Bill is studying for a BS in physics/a maths degree. Bill is studying for a BS in physics/a maths degree.
has frame element: Subject.education teaching
narrower match: synset-educational-adjective-1
has frame element: Degree.education teaching
has frame element: Time.education teaching
has lex unit: educational.a
has lex unit: training.n
has lex unit: schoolmaster.n
has lex unit: school.v
has frame element: Precept.education teaching
has frame element: Teacher.education teaching
definition: This frame contains words referring to teaching and the participants in teaching. A Student comes to learn either about a Subject; a Skill; a Precept; or a Fact as a result of instruction by a Teacher. Some of the nouns (schoolmaster, -mistress) in this frame refer to administrative positions and do not take relevant frame elements; these will be moved. Dad taught me that if you work hard, you will be OK - no matter what happens. What Our Cat Taught Me About Marketing! For two years she taught me French Mom and Dad taught me not to bullshit, because it always came back to bite me in the ass, without fail. A young swiss girl up in a swiss chalet taught me how to yodel. Young Murdock later met a blind martial arts master known as Stick, who taught him how to use his augmented senses and trained him as a fighter. Maria, a woman studying to be a nun is sent from her convent to be the governess of the seven children of a widowed naval captain Frame-Element relations: Several Frame element relations hold in this frame. There is a core-set {Material, Teacher} (possibly also including Institution); these FE's can fill the subject slot of the teach-type verbs. There is another core-set {Precept, Subject, Skill, Fact, Role} to do with what is learnt. In addition, the FE Qualification may occur with Subject and Role My sister is studying for a maths degree to be a teacher She's studying maths to be a teacher . Phrases expressing Qualification also very often include information about the Subject (see below), which is to be annotated on the second layer. Bill is studying for a BS in physics/a maths degree. Bill is studying for a BS in physics/a maths degree.
has frame element: Material.education teaching
has frame element: Skill.education teaching
has lex unit: tutee.n
has lex unit: schoolmistress.n
has lex unit: train.v
has frame element: Fact.education teaching
inherits from: Event
has lex unit: cram.v
frame sectivity: sub
definition: <def-root>This frame contains words referring to teaching and the participants in teaching. A <fen>Student</fen> comes to learn either about a <fen>Subject</fen>; a <fen>Skill</fen>; a <fen>Precept</fen>; or a <fen>Fact</fen> as a result of instruction by a <fen>Teacher</fen>. Some of the nouns (schoolmaster, -mistress) in this frame refer to administrative positions and do not take relevant frame elements; these will be moved. <ex><fex name="tea">Dad</fex> <t>taught</t> <fex name="">me</fex> <fex name="fac">that if you work hard, you will be OK - no matter what happens</fex>. </ex> <ex><fex name="fac">What</fex> <fex name="tea">Our Cat</fex> <t>Taught</t> <fex name="stu">Me</fex> <fex name="sub"> About Marketing</fex>!</ex> <ex>For two years <fex name="tea">she</fex> <t>taught</t> <fex name="stu">me</fex> <fex name="sub">French</fex></ex> <ex><fex name="tea">Mom and Dad</fex> <t>taught</t> <fex name="stu">me</fex> <fex name="pre">not to bullshit</fex>, because it always came back to bite me in the ass, without fail. </ex> <ex><fex name="tea">A young swiss girl up in a swiss chalet</fex> <t>taught</t> <fex name="stu">me</fex> <fex name="ski">how to yodel</fex>.</ex> <ex>Young Murdock later met <fex name="tea">a blind martial arts master known as Stick, who</fex> taught him how to use his augmented senses and <t>trained</t> <fex name="stu">him</fex> <fex name="rol">as a fighter</fex>.</ex> <ex> Maria, <fex name="stu">a woman</fex> <t>studying</t> <fex name="rol">to be a nun</fex> is sent from her convent to be the governess of the seven children of a widowed naval captain </ex> <ex></ex> Frame-Element relations: Several Frame element relations hold in this frame. There is a core-set {<fen>Material</fen>, <fen>Teacher</fen>} (possibly also including <fen>Institution</fen>); these FE's can fill the subject slot of the teach-type verbs. There is another core-set {<fen>Precept</fen>, <fen>Subject</fen>, <fen>Skill</fen>, <fen>Fact</fen>, <fen>Role</fen>} to do with what …
has lex unit: lecturer.n
has frame element: Place.education teaching
has lex unit: pupil.n
has frame element: Depictive.education teaching
has frame element: Course.education teaching
has lex unit: student.n
has frame element: Qualification.education teaching
has lex unit: study.v
definition: This frame contains words referring to teaching and the participants in teaching. A Student comes to learn either about a Subject; a Skill; a Precept; or a Fact as a result of instruction by a Teacher. Some of the nouns (schoolmaster, -mistress) in this frame refer to administrative positions and do not take relevant frame elements; these will be moved. Dad taught me that if you work hard, you will be OK - no matter what happens. What Our Cat taught Me About Marketing! For two years she taught me French Mom and Dad taught me not to bullshit, because it always came back to bite me in the ass, without fail. A young swiss girl up in a swiss chalet taught me how to yodel. Young Murdock later met a blind martial arts master known as Stick, who taught him how to use his augmented senses and trained him as a fighter. Maria, a woman studying to be a nun is sent from her convent to be the governess of the seven children of a widowed naval captain Frame-Element relations: Several Frame element relations hold in this frame. There is a core-set {Material, Teacher} (possibly also including Institution); these FE's can fill the subject slot of the teach-type verbs. There is another core-set {Precept, Subject, Skill, Fact, Role} to do with what is learnt. In addition, the FE Qualification may occur with Subject and Role My sister is studying for a maths degree to be a teacher She's studying maths to be a teacher . Phrases expressing Qualification also very often include information about the Subject (see below), which is to be annotated on the second layer. Bill is studying for a BS in physics/a maths degree. Bill is studying for a BS in physics/a maths degree.
subclass of: Restriction
  on property: hasComponent
  some values from: Studying
triggers: Education
inherits from: Intentionally affect
has lex unit: tutor.n
has sem type: Non-perspectivalized frame
see also: Memorization
has lex unit: instruct.v
has frame element: Duration.education teaching
has lex unit: graduate.n
has frame element: Purpose.education teaching
has lex unit: learn.v
has frame relation: Studying
inherits from: Transitive action
has frame element: Level.education teaching
has lex unit: teacher.n
has frame relation: Memorization
frame ID: 111
inherits from: Objective influence
is used by: Studying
frame c date: 2001-05-23T12:07:57+02:00
has frame element: Manner.education teaching
frame name: Education_teaching
has frame element: Means.education teaching
has lex unit: professor.n
has lex unit: coach.v
has lex unit: tutor.v
subclass of: Intentionally affect
has frame element: Result.education teaching
has lex unit: master.v
type: Frame
frame c by: Tess
has lex unit: teach.v
has lex unit: schoolteacher.n
has lex unit: protege.n
has lex unit: instruction.n
has lex unit: education.n
has f ecore set: education teaching coreSet1
inherits from: Intentionally act
has f ecore set: education teaching coreSet2
type: Class
triggers: Learning
has frame element: Institution.education teaching
has lex unit: educate.v
has frame element: Student.education teaching
has lex unit: educational.adj
has frame element: Role.education teaching
type: Non-perspectivalized frame