Documents
has frame element: Right.documents
has frame element: Specification.documents
has lex unit: opinion.n
frame c by: GlY
has frame element: Obligation.documents
has lex unit: testimony.n
has lex unit: license.n
type: Class
definition: Words in the frame refer to any Document that has a legal status. Some Document empowers the Bearer of the Document to execute the Right. Others indicate the Obligation of the Bearer. Still others show the identity or Status of the Bearer.
has frame element: Descriptor.documents
frame sectivity: inter
has lex unit: agreement.n
has lex unit: warrant.n
has lex unit: finding.n
has frame element: Medium.documents
has lex unit: lease.n
inherits from: Entity
has frame element: Bearer.documents
has lex unit: brief.n
comment: Words in the frame refer to any Document that has a legal status or conventional social significance. Some Documents empower the Bearer of the Document to execute the Right. Others indicate the Obligation of the Bearer. Still others show the identity or Status of the Bearer. They got their marriage licence from Canada.
uses: Grant permission
has lex unit: confirmation.n
inherits from: Text
subclass of: Restriction
  on property: hasComponent
  some values from: Terms of agreement
frame c date: 2003-02-04T14:07:21+01:00
has lex unit: visa.n
has frame element: Status.documents
has lex unit: contractual.a
has lex unit: authorization.n
has lex unit: permit.n
has lex unit: testament.n
has lex unit: document.n
has lex unit: affidavit.n
has lex unit: contractual.adj
has lex unit: writ.n
has lex unit: accord.n
uses: Obligation scenario
has frame relation: Obligation scenario
frame ID: 560
narrower match: synset-contractual-adjective-1
definition: Words in the frame refer to any Document that has a legal status or conventional social significance. Some Documents empower the Bearer of the Document to execute the Right. Others indicate the Obligation of the Bearer. Still others show the identity or Status of the Bearer. They got their marriage licence from Canada.
has lex unit: title.n
has lex unit: contract.n
frame name: Documents
has frame relation: Terms of agreement
has frame element: Document.documents
has lex unit: papers.n
has lex unit: ruling.n
has lex unit: business card.n
has lex unit: deposition.n
type: Frame
has lex unit: diploma.n
has lex unit: summons.n
has lex unit: charter.n
has lex unit: will.n
has lex unit: subpoena.n
has lex unit: treaty.n
has lex unit: deed.n
inherits from: Artifact
has lex unit: licence.n
has frame element: Issuer.documents
has frame relation: Text
definition: <def-root>Words in the frame refer to any <fen>Document</fen> that has a legal status. Some <fen>Document</fen> empowers the <fen>Bearer</fen> of the <fen>Document</fen> to execute the <fen>Right</fen>. Others indicate the <fen>Obligation</fen> of the <fen>Bearer</fen>. Still others show the identity or <fen>Status</fen> of the <fen>Bearer</fen>.</def-root>
has lex unit: certificate.n
is used by: Terms of agreement
has lex unit: orders.n
has lex unit: passport.n
subclass of: Text
has lex unit: identification.n