Discussion
type: Class
type: Frame
inherits from: Chatting
inherits from: Reciprocality
comment: Two (or more) people (the Interlocutors, also encodable as Interlocutor_1 and Interlocutor_2) talk to one another. No person is construed as only a speaker or only an addressee. Rather, it is understood that both (or all) participants do some speaking and some listening--the process is understood to be symmetrical or reciprocal. This frame differs from the Chatting frame in that the Interlocutors have a particular question that they are attempting to decide or understand. I would rather discuss politics with anyone but him. World leaders met to discuss global warming on the coldest day of the year.
subclass of: Reciprocality
subclass of: Restriction
  on property: hasComponent
  some values from: Meet with
subclass of: Restriction
  on property: hasComponent
  some values from: Topic
subclass of: Restriction
  on property: hasComponent
  some values from: Point of dispute
subclass of: Restriction
  on property: hasComponent
  some values from: Quarreling
subclass of: Restriction
  on property: hasComponent
  some values from: Jury deliberation
subclass of: Restriction
  on property: hasComponent
  some values from: Chatting
definition: Two (or more) people (the Interlocutors, also encodable as Interlocutor_1 and Interlocutor_2) talk to one another. No person is construed as only a speaker or only an addressee. Rather, it is understood that both (or all) participants do some speaking and some listening--the process is understood to be symmetrical or reciprocal. This frame differs from the Chatting frame in that the Interlocutors have a particular question that they are attempting to decide or understand. I would rather discuss politics with anyone but him. World leaders met to discuss global warming on the coldest day of the year.
frame ID: 34
frame c by: ChW
frame c date: 2001-02-07T13:12:00+01:00
frame name: Discussion
has frame element: Depictive.discussion
has frame element: Means of communication.discussion
has frame element: Manner.discussion
has frame element: Language.discussion
has frame element: Time.discussion
has frame element: Topic.discussion
has frame element: Period of iterations.discussion
has frame element: Interlocutor 1.discussion
has frame element: Duration.discussion
has frame element: Purpose.discussion
has frame element: Containing event.discussion
has frame element: Interlocutors.discussion
has frame element: Means.discussion
has frame element: Amount of discussion.discussion
has frame element: Interlocutor 2.discussion
has frame element: Place.discussion
has frame element: Domain.discussion
has frame element: Frequency.discussion
has frame relation: Quarreling
has frame relation: Jury deliberation
has frame relation: Communication
has frame relation: Point of dispute
has frame relation: Meet with
has frame relation: Chatting
has lex unit: exchange.n
has lex unit: negotiate.v
has lex unit: talk (to).v
has lex unit: discussant.n
has lex unit: dialogue.n
has lex unit: confer.v
has lex unit: dialog.n
has lex unit: debate.v
has lex unit: communication.n
has lex unit: negotiation.n
has lex unit: parley.v
has lex unit: discuss.v
has lex unit: talk over.v
has lex unit: debate.n
has lex unit: discussion.n
has lex unit: meeting.n
has lex unit: consultation.n
has lex unit: conference.n
has lex unit: communicate.v
has lex unit: talk.n
has lex unit: parley.n
has lex unit: interlocutor.n
is inherited by: Quarreling
is used by: Jury deliberation
is used by: Meet with
is used by: Point of dispute
uses: Communication